program: Gaussian 09
title: 000042999
version: EM64L-G09RevD.01
frameworkgroup: C1[X(C16H14N2O2)]
method: RPBEPBE
basis: SDD
operation: Freq
keyword: #p
keyword: freq=noraman
keyword: PBEPBE/SDD
title: #p freq=noraman PBEPBE/SDD
converged: YES YES NO NO
title: Mulliken charges:
elementType: O O N N C C C C C C C C C C C C C C C C H H H H H H H H H H H H H H
charge: -0.240302 -0.250703 -0.416937 -0.667335 0.254757 0.250294 -0.593047 0.166336 0.075163 0.478859 -0.356052 -0.344070 0.082399 -0.275024 -0.361118 -0.436417 -0.225600 -0.229638 -0.220527 -0.240626 0.269836 0.221875 0.288043 0.212268 0.263197 0.229421 0.242963 0.232629 0.234384 0.325723 0.336928 0.232022 0.228437 0.231862
chargesum: 0.00000
title: Mulliken charges with hydrogens summed into heavy atoms:
elementType: O O N N C C C C C C C C C C C C C C C C
charge: -0.240302 -0.250703 -0.128894 -0.004684 0.254757 0.250294 -0.101335 0.166336 0.075163 0.478859 -0.143784 -0.080873 0.082399 -0.045603 -0.118155 -0.203788 0.008784 0.002384 0.007910 -0.008765
polarizability: 2.38457368e+02 -1.70860925e+01 2.46053810e+02 3.46659068e+01 4.12362309e+00 1.25838046e+02
1716.lowfreq: -6.7265 -0.0008 -0.0006 -0.0002 3.8014 7.7696 15.3818 24.2274 35.8104
frequency: 15.2056 24.1849 35.7637 84.3917 104.3358 119.8328 128.9110 185.9865 255.3843 263.2695 286.7696 296.9596 324.8367 343.6628 401.5529 402.5972 419.6011 436.2975 446.7504 463.3082 498.9085 517.6268 536.6246 552.2740 566.5101 607.6377 616.0496 622.2840 629.4438 661.1976 669.0736 700.2275 706.4222 734.7415 756.4322 762.8429 806.7411 846.0732 853.3651 858.0069 881.8653 922.5337 938.2986 953.9212 977.1910 980.3065 989.8033 997.7008 1003.0819 1025.8284 1032.7787 1068.7840 1079.5814 1088.6458 1111.0146 1170.6862 1173.2620 1188.6277 1194.0250 1201.4533 1211.8338 1251.8231 1283.4347 1319.6884 1334.4893 1345.3563 1371.8073 1385.7089 1402.5017 1440.6923 1444.5207 1454.9044 1472.4651 1484.3035 1498.2262 1560.2636 1588.2259 1593.4674 1610.0142 1611.7066 1622.3123 1641.2096 2991.2314 3066.7446 3114.6254 3123.8500 3128.0098 3135.1086 3145.0166 3147.3850 3161.1710 3164.8019 3177.3262 3506.4476 3515.6998 3656.7763
redmass: 5.0655 5.4624 4.1543 4.5770 5.5333 5.8702 5.2801 5.2378 4.7747 4.1678 4.3233 3.2377 3.6912 5.6995 3.1343 2.8214 6.8648 4.2120 2.2639 2.1400 2.4029 5.9240 3.6518 1.4301 1.4864 3.6458 5.9625 5.7798 4.2076 4.3993 6.3059 7.7395 1.8062 3.7247 1.6346 1.5891 3.7035 3.6909 1.4867 1.2905 4.1743 1.4203 1.3834 3.0976 1.3202 1.3865 6.1939 1.5137 2.0007 2.2517 2.1279 4.8867 2.6053 1.6241 1.8019 1.1412 1.0565 1.1424 1.5953 2.8748 2.9143 1.4863 1.8603 1.3296 2.2029 1.5836 2.5073 5.9293 7.6915 2.0987 2.7050 1.6817 1.2611 1.8862 2.3943 3.9223 1.7997 5.9334 4.5496 5.9192 7.6089 4.7660 1.0637 1.1002 1.0877 1.0866 1.0864 1.0910 1.0894 1.0959 1.0945 1.1014 1.0994 1.0444 1.0748 1.1031
irintensity: 0.5952 1.9027 0.2647 0.0587 2.2422 1.5646 1.4864 0.8947 2.8608 1.7197 2.5825 3.9935 2.3173 2.8653 1.7605 0.8603 0.3708 9.2159 28.5027 55.4400 8.9748 24.2153 15.6121 24.0693 250.8584 36.2219 5.8940 18.4589 31.9490 36.3508 0.1728 11.5665 50.6555 7.7779 107.7792 33.1130 15.6713 6.5992 0.4618 0.2907 10.7498 2.1937 3.2362 6.7883 0.1306 0.1125 0.0601 1.3145 4.2543 6.7141 9.2742 135.2081 10.2275 35.0932 30.8760 3.9945 0.3207 3.7294 27.1027 18.0824 13.8241 10.2060 28.5737 3.3914 12.9481 5.1433 17.9358 1.9327 35.4353 30.3948 22.1261 56.9722 28.8164 4.2142 105.1329 80.3999 374.0716 4.3788 28.7268 4.3281 202.3397 379.0719 52.9237 5.4166 8.6265 4.2520 6.5596 9.7535 11.2533 37.4836 16.7034 21.4342 13.1447 100.0633 11.9564 33.3630
temp: 298.150 k
press: 1.00000 atm
elementType: 8 8 7 7 6 6 6 6 6 6 6 6 6 6 6 6 6 6 6 6 1 1 1 1 1 1 1 1 1 1 1 1 1 1
symmnumber: 1
zpe: 696732.8 jmol-1
zpe.correction: 0.265371 hartree
zpe.thermalcorrener: 0.282020 hartree
zpe.thermalcorrenthalpy: 0.282964 hartree
zpe.thermalcorrgfe: 0.219154 hartree
zpe.sumelectzpe: -876.665130 hartree
zpe.sumelectthermal: -876.648481 hartree
zpe.sumelectthermalent: -876.647537 hartree
zpe.sumelectthermalfe: -876.711348 hartree
dipole: -5.1760 1.5394 -2.7794
dipole: 6.0733
quadrupole: -125.3033 -104.6364 -116.0825
quadrupole: 8.8250 -1.9758 8.8742
quadrupole: -9.9626 10.7044 -0.7418 8.8250 -1.9758 8.8742
hfenergy: -876.9305017 hartree
pointgroup: C01 [X(C16H14N2O2)]
dipole: 1.8296668 -0.9518122 -1.2065424 debye
polarizability: 226.587875|-18.9392373|249.7392086|-43.3791578|-7.2928671|134.0221404 unknown
InChI: InChI=1S/C16H14N2O2/c17-14-15(18-10-11-6-2-1-3-7-11)12-8-4-5-9-13(12)20-16(14)19/h1-9,18H,10,17H2
charge 0 multiplicity 1
34 atoms
O  -3.058558 0.623704 1.039434
O  -3.036118 2.923005 1.214448
N  0.479177 0.808302 -1.356655
N  -0.806905 3.185835 -0.394301
C  -0.677087 0.730783 -0.547256
C  -1.305716 -0.551336 -0.242329
C  1.737035 1.449584 -0.863917
C  -2.508852 -0.562704 0.524811
C  -1.278157 1.910517 -0.084172
C  2.725101 0.439808 -0.286092
C  -0.790463 -1.81521 -0.658882
C  -3.195009 -1.752583 0.83459
C  -2.4752 1.894554 0.76035
C  -1.465992 -3.010569 -0.356536
C  2.449799 -0.230066 0.935746
C  3.927365 0.138825 -0.9740
C  -2.676554 -2.982666 0.384651
C  3.355894 -1.179789 1.453606
C  4.8383 -0.8120 -0.456706
C  4.554274 -1.474103 0.758872
H  1.452403 2.195029 -0.101591
H  2.214502 1.992729 -1.702009
H  0.650256 -0.007533 -1.950382
H  0.160989 -1.864807 -1.200614
H  -4.113705 -1.691294 1.425225
H  -1.049247 -3.967879 -0.686298
H  1.522975 -0.007752 1.478612
H  4.155183 0.654728 -1.915657
H  -3.202391 -3.913979 0.618345
H  -0.240444 3.30687 -1.232131
H  -1.364806 3.96877 -0.050148
H  3.132183 -1.686672 2.398865
H  5.765518 -1.031418 -0.997948
H  5.258949 -2.208982 1.163769
