program: Gaussian 09
title: 000005102
version: EM64L-G09RevD.01
frameworkgroup: C1[X(C23H22O6)]
method: RPBEPBE
basis: SDD
operation: Freq
keyword: #pfreq=noraman
keyword: PBEPBE/SDD
title: #p freq=noraman PBEPBE/SDD
converged: YES YES NO NO
title: Mulliken charges:
elementType: O O O O O O C C C C C C C C C C C C C C C C C C C C C C C H H H H H H H H H H H H H H H H H H H H H H
charge: -0.263950 -0.245970 -0.266133 -0.211013 -0.285851 -0.268869 -0.312593 -0.072845 0.104017 0.358221 0.045737 -0.381048 0.064251 0.206404 -0.562669 -0.230487 0.237367 0.107776 -0.378652 -0.488082 -0.390941 0.575880 -0.526917 0.171929 0.241818 -0.809078 -0.742285 -0.522930 -0.535436 0.266077 0.260002 0.213667 0.241098 0.255794 0.253140 0.243468 0.282170 0.296678 0.258451 0.263781 0.224127 0.256693 0.230197 0.227526 0.224776 0.227718 0.213650 0.249701 0.222679 0.226896 0.244058
chargesum: 0.00000
title: Mulliken charges with hydrogens summed into heavy atoms:
elementType: O O O O O O C C C C C C C C C C C C C C C C C C C C C C C
charge: -0.263950 -0.245970 -0.266133 -0.211013 -0.285851 -0.268869 -0.046516 0.187157 0.104017 0.358221 0.045737 0.073717 0.064251 0.206404 -0.053735 0.012981 0.237367 0.107776 -0.096482 -0.191404 -0.132490 0.575880 -0.263137 0.171929 0.241818 -0.098061 -0.289983 0.168139 0.158197
polarizability: 4.57547053e+02 2.46054019e+01 2.60457121e+02 3.73011706e+00 6.28075385e+00 1.51976050e+02
1716.lowfreq: -4.4275 -0.0008 0.0007 0.0009 4.2597 6.8996 17.8643 27.1535 35.3114
frequency: 17.3439 27.1229 35.2688 50.6002 60.1697 64.2447 81.3143 90.1961 105.7286 116.0537 142.0329 149.2994 162.0210 164.9239 174.9063 184.8817 215.9711 228.6483 242.7316 253.4820 261.1276 265.2424 283.8282 291.9260 301.1627 318.9868 338.6135 360.1542 378.0849 401.8784 419.8974 445.1841 453.8853 464.6925 481.5506 487.3881 502.5932 517.9190 544.2202 559.7000 582.9219 604.2405 620.2185 628.6902 661.4686 663.4993 680.1398 696.7530 715.2525 720.1700 733.0029 738.1607 756.6548 765.6819 791.0624 820.2793 837.1866 845.5853 880.1336 887.0010 901.0960 918.9272 929.1401 946.2786 959.0903 971.1829 975.0088 980.0858 986.0395 993.5875 1011.7770 1023.0558 1035.9818 1040.8713 1057.3412 1075.0231 1111.8680 1112.9560 1123.9398 1140.0374 1143.8942 1148.4941 1157.0911 1159.4634 1167.8727 1183.1705 1186.6890 1200.1482 1225.0697 1237.5818 1241.6961 1249.7821 1253.9716 1281.0765 1292.3256 1298.5889 1304.3194 1310.9689 1318.4601 1346.9284 1361.8524 1380.3955 1387.0937 1391.3460 1396.7334 1430.6078 1435.3664 1442.9926 1445.7323 1457.1197 1458.0627 1467.2090 1470.8603 1472.9329 1475.7148 1476.8305 1479.3071 1480.2090 1496.2042 1567.6507 1579.0242 1594.5585 1625.5055 1630.4703 1670.8533 2923.4269 2963.0724 2970.2643 2977.7225 2981.9939 2997.4342 3007.4182 3039.0661 3052.4002 3055.6572 3064.2393 3073.6320 3092.1066 3097.0451 3106.6111 3120.0869 3125.6035 3153.6404 3173.9020 3183.9560 3194.1210 3196.2018
redmass: 4.5021 5.5931 4.0407 3.1971 2.8898 4.6121 2.9638 6.1615 4.2363 2.8866 3.3796 3.3240 1.2805 1.6701 3.4507 3.0867 2.3781 2.8547 4.3836 4.7983 2.5603 3.2745 3.6607 6.3829 4.2425 4.5821 5.2262 4.9734 3.6852 6.2344 4.5206 4.0871 4.3883 3.5409 4.8061 4.4731 4.2410 4.7653 2.7758 6.8966 6.4895 6.1073 4.9225 4.1924 5.6840 5.7752 5.5310 4.4825 1.8539 2.5321 3.1985 3.9945 6.4623 3.4942 4.4705 1.8640 2.1123 2.0231 4.4092 3.9732 1.6762 5.2685 2.4602 2.4957 1.3263 5.1122 1.4727 1.3901 5.5072 5.9491 3.7102 1.9607 2.0245 2.8959 1.6449 3.7086 1.2499 1.2577 2.6339 2.0757 1.2015 1.8841 1.5849 1.5677 1.7076 1.4647 2.1124 2.4922 1.6950 1.3119 1.9243 1.4169 1.3127 3.4738 1.5720 4.4102 1.5595 1.7317 1.9331 1.5973 1.9484 3.7383 3.4421 7.1402 1.2458 1.2308 1.1960 1.3689 2.6546 1.0656 1.1596 1.0496 3.1015 1.1194 1.1094 1.2044 1.0830 1.0534 2.8388 9.4928 9.5576 9.7849 7.6006 9.4975 5.0370 1.0789 1.0326 1.0334 1.0380 1.0775 1.0734 1.0610 1.0909 1.1041 1.0953 1.0993 1.0996 1.0639 1.0990 1.0994 1.1033 1.0999 1.0894 1.0907 1.0961 1.0919 1.1138
irintensity: 0.1761 1.1902 0.6124 1.2214 2.5434 0.3992 1.9184 4.2440 3.9411 0.1423 2.6387 0.2492 2.1711 0.1365 0.6441 3.9014 1.2998 15.6261 2.7437 12.8890 0.5652 2.9959 5.7803 5.2852 0.0184 0.5548 4.2007 1.2751 5.4627 1.7087 0.5328 1.1701 13.6095 8.7042 4.9110 1.2191 10.4591 13.0166 21.0370 11.9086 2.0973 0.6553 2.1697 5.1703 5.1312 1.8618 1.9515 34.3731 2.3871 4.2284 11.6746 4.7420 15.7692 14.9953 9.4567 25.2843 8.0342 46.3091 98.4109 43.6522 28.1363 6.2734 49.1539 0.8507 60.3557 21.7574 6.7082 0.9742 45.5369 79.8290 0.5482 16.3171 9.0019 363.0580 7.1995 124.6862 6.1304 0.3272 20.0374 51.2965 1.7711 18.8383 33.0831 33.6451 24.7888 104.0335 65.5884 50.4610 6.7832 0.8875 198.8336 15.4334 10.2170 395.0387 19.0910 26.9924 19.0328 77.8586 2.2852 45.6654 33.3504 31.2130 29.2798 108.5257 23.8121 4.5117 2.7079 45.2265 25.1265 19.0742 1.3827 13.5742 46.5310 104.0664 5.0605 22.9876 29.1161 17.5917 280.0017 19.6844 259.5487 166.1068 26.6427 259.7795 14.5698 22.0402 68.9944 89.3950 17.2878 9.2312 61.4591 16.1872 17.7363 43.6825 17.2102 22.3406 40.0126 11.7929 27.4707 17.2038 24.0662 25.5439 0.7523 2.7933 4.8151 4.2936 19.3520
temp: 298.150 k
press: 1.00000 atm
elementType: 8 8 8 8 8 8 6 6 6 6 6 6 6 6 6 6 6 6 6 6 6 6 6 6 6 6 6 6 6 1 1 1 1 1 1 1 1 1 1 1 1 1 1 1 1 1 1 1 1 1 1
symmnumber: 1
zpe: 1046123.5 jmol-1
zpe.correction: 0.398447 hartree
zpe.thermalcorrener: 0.424705 hartree
zpe.thermalcorrenthalpy: 0.425649 hartree
zpe.thermalcorrgfe: 0.341201 hartree
zpe.sumelectzpe: -1338.835637 hartree
zpe.sumelectthermal: -1338.809380 hartree
zpe.sumelectthermalent: -1338.808435 hartree
zpe.sumelectthermalfe: -1338.892884 hartree
dipole: -2.0684 -4.3425 -0.6851
dipole: 4.8585
quadrupole: -139.6644 -166.4067 -168.9467
quadrupole: -2.9182 -12.4281 -0.6011
quadrupole: 18.6748 -8.0675 -10.6074 -2.9182 -12.4281 -0.6011
hfenergy: -1339.2340846 hartree
pointgroup: C01 [X(C23H22O6)]
dipole: -0.7814631 1.7252985 0.2577296 debye
polarizability: 456.5511074|-28.3284973|261.5352544|-3.3386436|5.6064058|151.8938631 unknown
InChI: InChI=1S/C23H22O6/c1-11(2)16-8-14-15(28-16)6-5-12-22(24)21-13-7-18(25-3)19(26-4)9-17(13)27-10-20(21)29-23(12)14/h5-7,9,16,20-21H,1,8,10H2,2-4H3
charge 0 multiplicity 1
51 atoms
O  -1.304181 1.23611 0.127808
O  2.180103 2.483713 0.507411
O  -5.492235 -0.914674 0.625897
O  0.777946 -2.431699 0.353961
O  5.356768 -1.950703 -0.935111
O  6.568871 0.461597 -0.08909
C  0.802719 -0.030901 -0.300439
C  0.139484 1.140812 0.451039
C  -1.994056 0.024623 0.293354
C  2.320899 0.093094 -0.219961
C  0.148283 -1.34608 0.197612
C  0.779799 2.471925 0.055852
C  -3.391656 0.079233 0.363567
C  -1.319106 -1.236782 0.396746
C  -4.348896 1.249837 0.271727
C  -5.750599 0.590738 0.531326
C  -4.116124 -1.116364 0.560012
C  2.921814 1.321571 0.159854
C  -2.095645 -2.413994 0.605019
C  3.189273 -0.976857 -0.553745
C  -3.496945 -2.381094 0.691321
C  -6.798028 0.840572 -0.537629
C  4.322879 1.472306 0.233212
C  4.588601 -0.85329 -0.498187
C  5.167139 0.392354 -0.097394
C  -6.519525 0.272897 -1.914461
C  -7.914062 1.55273 -0.232897
C  6.320167 -2.508803 0.036569
C  7.176626 1.752769 0.243567
H  0.486709 0.054687 -1.366335
H  0.239498 0.99363 1.546891
H  0.732396 2.613519 -1.042433
H  0.295832 3.320585 0.56304
H  -4.134348 2.028445 1.024077
H  -4.306189 1.738154 -0.718564
H  -6.145583 0.873092 1.522719
H  -1.550836 -3.360966 0.679456
H  2.777483 -1.946143 -0.840631
H  -4.091547 -3.283773 0.848553
H  4.715758 2.448895 0.526642
H  -5.553282 0.630589 -2.320142
H  -6.455706 -0.829583 -1.864061
H  -7.313463 0.545444 -2.629181
H  -8.670558 1.786753 -0.989955
H  -8.102816 1.923583 0.782029
H  6.776883 -3.369195 -0.476288
H  5.792958 -2.852082 0.948083
H  7.090638 -1.76447 0.300064
H  6.916392 2.067496 1.272778
H  6.865807 2.535685 -0.474632
H  8.261362 1.587516 0.167648
