program: Gaussian 09
title: 000005061
version: EM64L-G09RevD.01
frameworkgroup: C1[X(C14H8Cl2N2)]
method: RPBEPBE
basis: SDD
operation: Freq
keyword: #p
keyword: freq=noraman
keyword: PBEPBE/SDD
title: #p freq=noraman PBEPBE/SDD
converged: YES YES NO NO
title: Mulliken charges:
elementType: Cl Cl N N C C C C C C C C C C C C C C H H H H H H H H
charge: -0.031912 -0.034944 0.007294 -0.012611 0.513917 -0.376402 0.318414 0.272708 -0.385249 -0.270897 -0.124051 -0.106746 -0.286230 -0.243499 -0.473052 -0.181156 -0.341838 -0.311976 0.233952 0.261276 0.281028 0.262908 0.288651 0.250608 0.238739 0.251069
chargesum: 0.00000
title: Mulliken charges with hydrogens summed into heavy atoms:
elementType: Cl Cl N N C C C C C C C C C C C C C C
charge: -0.031912 -0.034944 0.007294 -0.012611 0.513917 -0.142450 0.318414 0.272708 -0.123973 0.010131 -0.124051 -0.106746 -0.023322 0.045151 -0.222444 0.057582 -0.090769 -0.311976
polarizability: 3.47146576e+02 -7.77358700e+00 2.10126582e+02 4.14485237e+00 -7.08860534e+00 7.36520542e+01
1716.lowfreq: -4.2756 -0.0026 -0.0021 -0.0011 1.1010 3.4625 20.5229 39.2922 52.9680
frequency: 20.4881 39.2684 52.9668 64.5629 121.3865 137.5821 144.8597 165.0441 178.6434 201.6540 245.0702 268.3527 318.2384 346.3446 376.7515 392.4479 409.9036 419.5133 464.5732 480.2478 513.1757 563.5875 591.7079 615.9564 663.0087 678.8194 699.7205 715.8563 744.8021 785.3439 820.2185 863.7658 871.9326 891.0490 894.5271 916.3387 936.9008 946.2928 977.0345 982.4486 992.4170 1010.8097 1043.3846 1102.0120 1116.7330 1124.9957 1203.7776 1221.6926 1266.8389 1274.1398 1308.2857 1338.6906 1352.0539 1385.1080 1408.8733 1422.8362 1439.1608 1461.3634 1543.8121 1551.5370 1576.0501 1590.5036 1603.7694 2156.6216 3118.2324 3125.9445 3139.3253 3146.3970 3157.9358 3172.6813 3187.1105 3199.2824
redmass: 9.7171 5.2586 7.0009 8.5582 8.8400 9.1458 11.4871 8.6752 6.0397 4.5024 9.3159 4.7180 4.0592 6.5517 13.5503 3.1275 9.0034 5.7143 6.7127 6.2163 5.0551 4.5481 7.7832 7.5031 4.9790 2.2776 6.9400 1.9228 9.0185 7.9149 1.6519 1.5549 1.3762 6.5475 1.4405 1.4587 1.5507 1.4937 6.1691 4.6053 1.4281 4.5934 2.3886 1.4982 2.0481 1.6475 1.3601 2.3783 2.3115 1.4941 8.1721 1.5875 1.7222 3.7562 2.6697 2.1817 2.6681 2.1670 5.1058 6.2021 5.6817 6.7386 6.6529 12.6330 1.0891 1.0893 1.0881 1.0928 1.0927 1.1001 1.0940 1.0925
irintensity: 0.1964 2.3631 2.0985 1.8710 1.0448 1.0122 2.3447 1.7910 0.9315 0.0345 0.3066 1.9968 0.3983 2.2718 4.0611 3.1889 5.8256 0.4936 1.5893 3.2930 0.0398 2.1031 14.9636 11.0468 5.1218 22.8896 1.6871 39.5347 58.3436 30.4308 36.9040 33.9932 0.1030 14.4608 3.4153 6.0094 30.4985 0.5022 13.7600 29.4376 0.3078 2.3716 3.1186 8.3415 21.2276 7.6078 4.6316 29.6063 45.2683 5.6014 1.5286 17.2715 0.2994 18.5597 22.4635 20.9837 21.7699 17.7711 32.3441 102.9380 11.6021 31.8212 27.1932 21.4132 23.4275 5.1498 0.3230 12.3118 0.5698 25.5900 4.6060 4.4644
temp: 298.150 k
press: 1.00000 atm
elementType: 17 17 7 7 6 6 6 6 6 6 6 6 6 6 6 6 6 6 1 1 1 1 1 1 1 1
symmnumber: 1
zpe: 468115.3 jmol-1
zpe.correction: 0.178296 hartree
zpe.thermalcorrener: 0.193951 hartree
zpe.thermalcorrenthalpy: 0.194895 hartree
zpe.thermalcorrgfe: 0.132635 hartree
zpe.sumelectzpe: -1566.654835 hartree
zpe.sumelectthermal: -1566.639180 hartree
zpe.sumelectthermalent: -1566.638236 hartree
zpe.sumelectthermalfe: -1566.700496 hartree
dipole: -1.2735 -1.4421 -0.9023
dipole: 2.1250
quadrupole: -106.8924 -132.5210 -120.7480
quadrupole: -6.0900 6.1343 0.0614
quadrupole: 13.1614 -12.4672 -0.6942 -6.0900 6.1343 0.0614
hfenergy: -1566.833131 hartree
pointgroup: C01[X(C14H8Cl2N2)]
dipole: -0.4918229 -0.554935 0.3861403 debye
dipolederiv: -0.3305157 -0.1229728 0.2298774 -0.1908003 -0.1690629 0.2252872 0.3707492 0.2336708 -0.4952728 -0.4139596 0.1331458 -0.2958001 0.1823001 -0.153192 0.2131266 -0.3946744 0.210812 -0.5097167 -0.5283193 -0.044412 0.0323668 -0.0922012 -0.2441236 -0.0089525 0.0494655 0.003889 -0.3253106 -0.225607 0.0050071 -0.0171071 0.0485023 -0.2405117 0.0139143 -0.1328504 0.0287471 -0.2980607 0.0625368 -0.0164127 0.0344429 -0.0603715 0.0714524 -0.0553913 0.0329482 -0.0607413 0.1735914 0.3949745 -0.0462211 0.1713708 0.0797527 -0.059467 -0.0648632 -0.0536846 -0.0653373 0.0207307 0.1699723 0.0136639 -0.0619752 -0.0199148 0.0272946 0.0089927 -0.0713903 0.0147203 -0.2114851 0.196427 0.0308775 -0.1098223 0.228317 0.0735295 0.0031153 -0.3887727 -0.0066674 0.0034679 -0.3503418 0.1005046 -0.2173589 0.0305418 -0.1435613 0.0325282 -0.0842816 0.0336754 -0.2026149 -0.3372681 -0.086711 0.1476031 -0.0479773 -0.1330948 0.0917445 0.0812559 0.0845478 -0.2599831 0.483685 0.210421 -0.3936739 0.374836 0.165214 -0.4101556 -0.7085576 -0.4274402 0.7610148 0.7133655 -0.2178447 0.4933117 -0.3265195 0.1377233 -0.3894782 0.7205704 -0.3783558 0.7821244 0.0227705 0.0198233 -0.0388109 -0.0109307 -0.1003053 -0.0128464 0.0755325 0.0054895 0.1098373 -0.3412376 0.0152908 -0.0522317 -0.0292888 -0.1492827 0.1630959 0.0381359 0.1677258 -0.4026905 0.1023663 0.0664493 0.0009948 0.1033404 -0.0449435 0.0233423 -0.02334 0.049912 0.2157441 -0.0707206 0.0013602 0.1284813 -0.0383723 -0.1004298 0.0381412 0.3395207 0.0314967 -0.0736986 0.2892481 0.073297 -0.0264852 0.0611019 -0.0584114 0.0025897 -0.1487356 -0.0223022 0.1597687 -0.1144479 0.0031154 0.0019747 -0.1488451 0.0596489 -0.0497425 0.2647903 -0.067939 0.219524 0.0602494 -0.0083683 0.0129853 -0.0397828 0.0884723 0.057614 0.1114753 0.0735042 -0.0189319 0.0730115 -0.0323797 0.0662267 -0.031985 0.132898 0.056978 0.0565798 0.0589922 0.0461566 0.1365633 0.0162078 -0.0255591 0.0104992 0.1353706 0.0428303 -0.0193243 0.0433652 0.0643961 0.1319631 -0.0025122 0.0489449 0.0319578 0.1438173 0.007063 0.043679 0.0017904 -0.0234852 0.0447046 -0.0053393 0.0031205 -0.0047296 0.1611633 0.0242765 0.0028738 0.0245865 0.123079 -0.0187798 -0.0376874 -0.087964 -0.076796 0.1077767 0.0020424 -0.0984824 -0.0275498 0.0433794 -0.0361959 -0.0276703 -0.0782038 -0.0296097 0.1550753 -0.0106381 -0.1193088 -0.0189622 0.0160246 -0.1144445 -0.0406321 0.0332913 -0.0030244 0.1369498 -0.0046142 0.0558264 0.0083703 0.0824112 unknown
polarizability: 346.7261569|7.6332206|88.3506232|11.3936751|-42.34756|195.8484319 unknown
InChI: InChI=1S/C14H8Cl2N2/c15-13-5-10(6-14(16)7-13)4-12(8-17)11-2-1-3-18-9-11/h1-7,9H
charge 0 multiplicity 1
26 atoms
Cl 4.288112 1.266733 -2.260758
Cl 4.638055 -1.15486 2.718999
N  -4.169737 -0.285225 1.907533
N  -0.787404 1.042645 -2.746551
C  1.426781 -0.0988 0.359385
C  -0.02479 -0.223682 0.533376
C  -2.502289 -0.078057 0.10914
C  -1.079548 0.104725 -0.299233
C  2.234957 -0.594152 1.428647
C  2.072168 0.475398 -0.777656
C  3.473846 0.532911 -0.810926
C  3.633069 -0.5143 1.345775
C  -3.534667 -0.232294 -0.856646
C  4.289202 0.046807 0.232933
C  -2.893535 -0.086995 1.480523
C  -4.863268 -0.427645 -0.428921
C  -5.136308 -0.465547 0.95735
C  -0.884887 0.620718 -1.630185
H  -0.312215 -0.671804 1.493775
H  1.764952 -1.036954 2.312386
H  1.500598 0.870421 -1.618649
H  -3.296943 -0.206821 -1.925722
H  5.378801 0.103953 0.179675
H  -2.161873 0.106805 2.274018
H  -5.673066 -0.553538 -1.153705
H  -6.151511 -0.632747 1.332939
