program: Gaussian 09
title: 000042889
version: EM64L-G09RevD.01
frameworkgroup: C1[X(C11H11ClO)]
method: RPBEPBE
basis: SDD
operation: Freq
keyword: #p
keyword: freq=noraman
keyword: PBEPBE/SDD
title: #p freq=noraman PBEPBE/SDD
converged: YES YES NO NO
title: Mulliken charges:
elementType: Cl O C C C C C C C C C C C H H H H H H H H H H H
charge: -0.017915 -0.234501 0.311066 0.187258 0.454080 -0.546062 -0.371812 -0.363238 -0.830999 -0.805493 0.023671 -0.087605 -0.433459 0.274680 0.230534 0.234175 0.230716 0.238846 0.248287 0.232954 0.227574 0.233952 0.262348 0.300942
chargesum: 0.00000
title: Mulliken charges with hydrogens summed into heavy atoms:
elementType: Cl O C C C C C C C C C C C
charge: -0.017915 -0.234501 0.311066 0.187258 0.454080 -0.271382 -0.141278 -0.129063 -0.113150 -0.111013 0.023671 0.174743 -0.132518
polarizability: 2.18451805e+02 7.56457395e-01 1.30704248e+02 4.53890627e+00 -5.70704633e+00 6.95973280e+01
1716.lowfreq: -10.5657 -4.6055 -1.0835 -0.0020 -0.0011 -0.0008 29.6528 36.7078 65.1827
frequency: 29.6377 36.7020 65.1515 97.7254 129.3911 162.4685 169.6153 186.6422 211.6921 249.3894 297.5874 316.5885 360.5683 367.5997 424.9042 458.0390 492.1312 561.0640 637.1561 675.3354 708.3088 741.1834 750.1646 826.8322 834.6097 843.9952 899.1999 918.3508 948.9316 969.1755 979.9613 1005.6265 1037.5795 1050.4239 1054.6396 1128.9738 1175.1898 1206.5139 1217.1177 1253.4990 1281.4524 1301.6670 1372.2621 1395.4324 1399.3380 1401.0229 1466.6571 1472.5694 1477.3721 1477.9587 1492.4555 1516.0127 1571.5945 1608.8942 1624.3900 2973.5752 2978.6869 3056.6089 3057.9291 3089.9122 3093.3436 3114.3266 3137.9416 3144.3139 3174.8134 3191.4598
redmass: 4.6338 1.1076 5.4049 3.2966 2.9109 2.2105 1.7994 2.6507 4.3320 7.1555 3.1888 3.2028 5.5060 4.1427 3.2663 4.7331 3.0707 3.9092 8.7806 3.7399 6.2913 3.2640 3.9135 1.3376 4.9029 2.1507 3.5664 1.4480 1.0951 1.3600 1.5753 1.4169 1.5739 1.5791 2.6696 1.9011 1.3912 2.2598 1.6046 1.9892 1.4054 1.8284 7.6493 3.1463 1.2277 1.2214 1.1027 1.0534 1.1084 1.1130 2.6219 9.8104 5.5354 6.5388 6.5728 1.0417 1.0380 1.0925 1.0967 1.0990 1.0991 1.0871 1.0960 1.0924 1.0920 1.0951
irintensity: 1.2124 0.1908 0.0599 1.5047 0.6590 3.0568 2.5723 2.0698 4.5495 1.5631 0.4030 0.2835 3.9213 1.1138 0.5408 1.5414 16.1920 7.5626 66.6387 4.6494 44.5044 13.3113 8.2963 25.5508 18.4848 5.7108 7.0171 9.8210 69.6678 0.2172 15.5100 4.2549 6.5395 16.4860 13.4329 18.8448 25.4408 1.6817 25.2780 44.4197 3.3601 109.6043 18.4762 57.2171 10.0665 12.5894 7.7775 13.6020 17.7879 24.4549 15.4235 189.1086 6.0474 296.8676 25.1870 27.1093 34.2513 21.0367 21.7758 15.0982 14.6007 10.2868 27.9392 7.3543 3.9516 1.1595
temp: 298.150 k
press: 1.00000 atm
elementType: 17 8 6 6 6 6 6 6 6 6 6 6 6 1 1 1 1 1 1 1 1 1 1 1
symmnumber: 1
zpe: 486591.0 jmol-1
zpe.correction: 0.185333 hartree
zpe.thermalcorrener: 0.198754 hartree
zpe.thermalcorrenthalpy: 0.199699 hartree
zpe.thermalcorrgfe: 0.143540 hartree
zpe.sumelectzpe: -960.095760 hartree
zpe.sumelectthermal: -960.082338 hartree
zpe.sumelectthermalent: -960.081394 hartree
zpe.sumelectthermalfe: -960.137552 hartree
dipole: -2.1002 2.4251 -1.0191
dipole: 3.3661
quadrupole: -77.0907 -81.0666 -87.1553
quadrupole: 0.6109 2.6767 2.7632
quadrupole: 4.6802 0.7043 -5.3844 0.6109 2.6767 2.7632
hfenergy: -960.2810923 hartree
pointgroup: C01 [X(C11H11Cl1O1)]
dipole: -0.9457749 0.6027515 -0.7043117 debye
dipolederiv: -0.8668916 -0.1141885 0.1558304 -0.3087362 -0.1155265 0.0993891 0.4691659 0.1009063 -0.1994354 -0.7836967 0.0857644 -0.0940264 0.105853 -0.5511291 0.3163772 0.0434728 0.2518484 -0.6624131 0.2163044 0.2309578 -0.0174517 -0.0809602 0.1748362 -0.0625158 0.1867175 -0.0627265 -0.0033203 -0.8078447 0.1051047 -0.164194 0.021187 -0.065576 0.0534453 -0.0862131 0.0341063 -0.0846713 0.0930871 0.3404084 -0.0798455 0.3472895 0.1351635 0.0169525 -0.0503893 0.0580264 -0.0632986 0.0531324 -0.2207171 0.1133545 0.1229549 -0.0645625 -0.0071377 -0.116929 -0.069579 -0.1203908 -0.2523491 -0.2028313 0.0515676 -0.1372649 0.0003847 -0.0806172 0.02877 -0.0999196 -0.118151 0.0880811 -0.0268662 0.0675316 -0.095207 -0.0214637 -0.0621444 0.0936357 -0.0407573 -0.1135151 -0.0369479 -0.1106032 -0.0061948 -0.0306336 -0.0776607 0.0302205 -0.0040998 0.0873338 0.0475635 -0.0673524 -0.126487 0.011268 -0.097876 -0.036984 0.0120348 -0.0459662 -0.0501487 0.077383 2.0632092 -0.0829038 0.0850658 0.067941 0.4473671 -0.4245723 -0.2780466 -0.3403465 0.6364999 -1.2845733 -0.188065 0.2390684 -0.1292023 -0.1429331 0.0004349 0.1239887 -0.0098131 -0.1144687 1.402921 0.2193524 -0.2895604 0.2168931 -0.0059978 -0.2258635 -0.3416604 -0.210144 0.2012899 0.1157819 0.0366163 -0.0190818 0.0219612 -0.0051558 0.0454563 0.0196816 0.0731115 0.1235172 0.0616867 0.0333634 -0.0304483 0.0636959 -0.0953015 0.085281 -0.0500667 0.0653808 0.1150167 -0.1220664 0.0129846 -0.062231 0.0121609 0.0959339 0.0175063 -0.0552457 0.0188376 0.127016 0.024939 -0.0789116 0.1066388 -0.0378288 0.0501832 -0.0185253 0.137682 0.0183953 -0.0677328 -0.0232902 0.1515585 0.0095644 0.0565608 -0.0731379 -0.009265 -0.0015966 -0.0182093 0.1125713 -0.0100129 -0.0531493 -0.0869253 -0.0483953 0.0729843 0.0350651 -0.1280347 -0.0155822 -0.0016992 0.0523692 0.0967528 -0.0778268 0.0027747 -0.032278 0.0818731 -0.0142458 0.1158924 0.0374026 -0.1054558 0.0015599 0.0960503 0.0614768 0.0367184 -0.0431978 0.1057985 0.0089049 0.0649108 0.0513567 -0.0719046 -0.035824 -0.0914475 0.0117624 -0.0480316 -0.0720564 -0.0996036 -0.0800315 0.0975213 0.0019236 -0.0278238 -0.0234594 0.1071189 0.0939921 0.0004859 0.0960086 0.0150063 0.0400911 -0.0397193 0.0554943 -0.0197376 0.1552541 0.0938424 0.035152 0.0880776 0.0709505 unknown
polarizability: 215.8978909|16.2253764|120.9063339|3.7806445|-25.0504589|81.9491566 unknown
InChI: InChI=1S/C11H11ClO/c1-8-3-4-9(2)10(7-8)11(13)5-6-12/h3-7H,1-2H3
charge 0 multiplicity 1
24 atoms
Cl 5.00281 0.532672 -0.688941
O  1.360827 -1.253769 1.520135
C  -0.691412 1.168766 -0.350458
C  -0.25986 -0.098207 0.155488
C  -2.563411 -1.010832 -0.020176
C  -1.205635 -1.148871 0.332613
C  -2.06363 1.302836 -0.688402
C  -2.978965 0.241668 -0.544621
C  0.200764 2.396089 -0.487139
C  -3.545763 -2.156641 0.144898
C  1.148061 -0.430091 0.572014
C  2.292659 0.150252 -0.201284
C  3.564577 -0.076774 0.20924
H  -0.83996 -2.088831 0.760863
H  -2.420176 2.271759 -1.058929
H  -4.029459 0.390875 -0.823899
H  0.692814 2.441786 -1.478645
H  -0.404962 3.313933 -0.390619
H  0.992376 2.436345 0.279151
H  -3.119001 -2.968335 0.758038
H  -4.480497 -1.819653 0.629181
H  -3.824009 -2.589159 -0.835354
H  2.087419 0.715929 -1.113846
H  3.820234 -0.645648 1.106696
