program: Gaussian 09
title: 000042848
version: EM64L-G09RevD.01
frameworkgroup: C1[X(C7H17NO2)]
method: RPBEPBE
basis: SDD
operation: Freq
keyword: #p
keyword: freq=noraman
keyword: PBEPBE/SDD
title: #p freq=noraman PBEPBE/SDD
converged: YES YES NO NO
title: Mulliken charges:
elementType: O O N C C C C C C C H H H H H H H H H H H H H H H H H
charge: -0.456512 -0.439032 -0.117494 -0.340973 -0.364955 -0.384646 -0.354503 -0.319081 -0.319763 -0.683821 0.202611 0.186889 0.219853 0.219752 0.185527 0.227762 0.197974 0.210994 0.203735 0.191415 0.231035 0.189066 0.206909 0.209156 0.221315 0.346258 0.330531
chargesum: 0.00000
title: Mulliken charges with hydrogens summed into heavy atoms:
elementType: O O N C C C C C C C
charge: -0.110254 -0.108501 -0.117494 0.048526 0.074650 0.028643 0.054464 0.076069 0.100338 -0.046441
polarizability: 9.97415455e+01 -6.98258366e-01 9.79194785e+01 1.46692406e+00 2.71758554e+00 7.90106883e+01
1716.lowfreq: -12.1197 -7.4221 -6.0275 -0.0010 -0.0004 0.0004 45.2256 52.1569 56.2818
frequency: 45.0699 52.0552 56.1475 71.5209 85.2636 104.5548 189.6313 212.0782 219.2739 232.0893 264.3326 296.6635 322.3985 332.2636 352.1419 391.0797 507.9960 525.1830 745.2406 794.4257 809.7948 837.0494 871.4379 905.0477 954.8891 971.7892 1002.6505 1031.7154 1041.1318 1057.6505 1072.4355 1087.0177 1116.1943 1135.8635 1165.7181 1207.3688 1211.5229 1243.4529 1255.1896 1280.9743 1289.6560 1291.5059 1310.1770 1315.7442 1343.7325 1351.7864 1369.4740 1381.6456 1387.2919 1410.6236 1463.9532 1465.8038 1471.8443 1474.7825 1477.0899 1479.2990 1486.0130 1488.7257 2842.7988 2860.3031 2918.6728 2946.4752 2961.1929 2972.7952 2984.5898 3004.0309 3011.0217 3038.1711 3047.5523 3052.1666 3070.1684 3076.3186 3100.1382 3556.1250 3576.8926
redmass: 3.7921 3.7675 3.4760 1.6746 2.3403 2.1182 1.9828 2.5426 1.2985 2.6605 1.0777 2.5990 1.4253 3.2904 2.9860 3.1077 3.2737 3.5676 1.0912 1.1545 1.1969 2.8080 1.2323 1.9628 4.3435 7.1115 2.2019 2.9233 2.0643 2.3893 1.9742 1.8161 2.0704 1.4723 1.3228 1.4443 1.5255 1.6292 1.3940 1.1304 1.1279 1.1733 1.3489 1.4362 1.2842 1.3032 1.3893 1.3350 1.2272 1.4542 1.0721 1.0716 1.0753 1.0754 1.0436 1.0730 1.0846 1.0851 1.0712 1.0705 1.0689 1.0568 1.0694 1.0357 1.0616 1.1026 1.0871 1.1000 1.0938 1.0885 1.1013 1.0989 1.0965 1.0661 1.0666
irintensity: 0.6010 1.4643 0.5850 0.8021 10.7216 4.6572 4.5397 0.9767 0.2736 15.2301 141.2509 16.1529 135.2624 14.7855 2.7046 35.1550 2.4169 4.3191 7.4477 9.7023 3.9977 20.4629 2.0933 0.7970 123.9908 83.5961 35.0639 41.7742 1.9030 20.3177 2.3018 35.0792 1.1545 0.8335 8.3675 43.8284 3.8883 14.4678 6.2154 3.1838 4.3474 6.0623 6.0899 19.1146 20.1929 6.9810 2.9542 1.1461 14.8212 0.0240 1.2114 0.7129 4.3959 4.4290 12.9751 9.3805 5.5783 13.8622 84.6092 113.0488 63.2295 71.0916 61.1737 40.4871 24.2638 39.2883 21.8515 5.9954 40.9539 42.6651 91.0528 45.3765 30.6572 6.5376 3.7581
temp: 298.150 k
press: 1.00000 atm
elementType: 8 8 7 6 6 6 6 6 6 6 1 1 1 1 1 1 1 1 1 1 1 1 1 1 1 1 1
symmnumber: 1
zpe: 624073.0 jmol-1
zpe.correction: 0.237697 hartree
zpe.thermalcorrener: 0.251212 hartree
zpe.thermalcorrenthalpy: 0.252156 hartree
zpe.thermalcorrgfe: 0.196477 hartree
zpe.sumelectzpe: -481.232166 hartree
zpe.sumelectthermal: -481.218651 hartree
zpe.sumelectthermalent: -481.217707 hartree
zpe.sumelectthermalfe: -481.273386 hartree
dipole: -0.6230 -1.8880 0.1855
dipole: 1.9968
quadrupole: -63.3013 -69.5619 -61.9449
quadrupole: 0.2144 -1.4068 10.9546
quadrupole: 1.6347 -4.6259 2.9912 0.2144 -1.4068 10.9546
hfenergy: -481.4698627 hartree
pointgroup: C01 [X(C7H17N1O2)]
dipole: 0.0811759 0.7778655 0.0741993 debye
polarizability: 99.9678072|-0.219241|97.7131425|-0.5833371|-2.9665191|78.9907626 unknown
InChI: InChI=1S/C7H17NO2/c1-2-3-8(4-6-9)5-7-10/h9-10H,2-7H2,1H3
charge 0 multiplicity 1
27 atoms
O  -2.966493 2.307577 0.002717
O  -0.600925 -3.697664 -0.129377
N  0.00068 0.040925 0.216326
C  1.21652 0.817462 0.564896
C  -1.27037 0.703699 0.593178
C  0.066328 -1.393528 0.565903
C  2.386371 0.589531 -0.416924
C  -1.741251 1.665471 -0.506719
C  -0.651507 -2.268801 -0.483149
C  3.647691 1.384343 -0.015227
H  0.95046 1.892209 0.548611
H  1.560086 0.596513 1.607431
H  -1.188129 1.268241 1.550406
H  -2.056693 -0.058847 0.741262
H  -0.368078 -1.599978 1.578619
H  1.123033 -1.712313 0.607479
H  2.629111 -0.490408 -0.464393
H  2.051894 0.879011 -1.431275
H  -1.935937 1.092629 -1.43661
H  -0.954443 2.421312 -0.71724
H  -0.132084 -2.195642 -1.451013
H  -1.700899 -1.931304 -0.622207
H  3.441567 2.471097 0.020056
H  4.011957 1.079791 0.98431
H  4.468613 1.221314 -0.736616
H  -3.323873 2.926794 -0.681331
H  -1.06703 -3.829834 0.734987
