program: Gaussian 09
title: 000005025
version: EM64L-G09RevD.01
frameworkgroup: C1[X(C18H23N)]
method: RPBEPBE
basis: SDD
operation: Freq
keyword: #pfreq=noraman
keyword: PBEPBE/SDD
title: #p freq=noraman PBEPBE/SDD
converged: YES YES NO NO
title: Mulliken charges:
elementType: N C C C C C C C C C C C C C C C C C C H H H H H H H H H H H H H H H H H H H H H H H
charge: -0.301143 -0.030060 -0.612872 -0.345438 -0.407285 -0.552220 -0.714623 0.499699 0.505030 -0.426412 -0.398291 -0.404743 -0.421250 -0.230051 -0.233689 -0.243476 -0.230398 -0.227201 -0.244147 0.198773 0.231958 0.192778 0.207000 0.172670 0.238924 0.195003 0.231418 0.201610 0.202672 0.237387 0.217532 0.218212 0.235429 0.229605 0.231761 0.230286 0.223832 0.222869 0.227084 0.222770 0.222446 0.226553
chargesum: 0.00000
title: Mulliken charges with hydrogens summed into heavy atoms:
elementType: N C C C C C C C C C C C C C C C C C C
charge: -0.062219 0.168714 -0.188136 0.034232 0.019136 -0.147938 -0.041492 0.499699 0.505030 -0.190983 -0.168686 -0.172983 -0.190964 -0.006219 -0.010820 -0.016392 -0.007628 -0.004755 -0.017595
polarizability: 2.75653365e+02 4.04651933e+00 1.85773470e+02 -2.80363661e+01 1.25241173e+01 1.29142935e+02
1716.lowfreq: -21.5523 -5.6967 -2.4864 -0.0008 -0.0002 0.0006 8.4378 13.0277 28.1419
frequency: 6.2683 12.3362 28.0608 35.2702 43.3156 65.6954 68.6824 108.9868 126.4636 132.3142 172.6244 224.0631 234.1457 259.1285 328.3135 334.4537 354.5951 379.6212 403.1144 404.4581 425.3696 466.3203 511.9963 521.0131 578.4903 598.4164 617.3756 617.8441 668.8537 705.3897 705.9056 752.6591 759.3946 760.5788 807.9380 819.5968 840.0942 852.1182 853.2804 863.7404 890.7678 915.9730 918.4267 944.9863 974.4555 975.0704 989.8409 990.1301 992.5596 993.0884 1023.6363 1026.7816 1029.3911 1038.5118 1044.4672 1051.4448 1075.4883 1094.2095 1103.7529 1130.3858 1152.9681 1171.0236 1171.2700 1173.0347 1186.0537 1186.9864 1210.2344 1216.8970 1221.5808 1252.6098 1257.5489 1276.0210 1281.4607 1314.1248 1325.7908 1327.0462 1332.9326 1343.3427 1369.0319 1381.6121 1382.0222 1383.9905 1438.8894 1439.8308 1460.6125 1468.2835 1469.1168 1471.5402 1480.6576 1483.1355 1483.4201 1484.4623 1497.2148 1591.9898 1592.7692 1614.0756 1614.3189 2832.5301 2837.9678 2961.2429 2968.3552 2977.5148 2985.1471 3007.0225 3022.1996 3039.5018 3052.8758 3082.0457 3091.2052 3112.5557 3112.6363 3114.0828 3117.4371 3130.3954 3131.2555 3141.8157 3142.5901 3161.0557 3161.1699 3404.9340
redmass: 3.8299 3.9026 4.3786 3.6588 3.3350 2.8503 4.1986 1.9867 2.7953 3.0358 4.9819 1.4490 3.2323 2.6683 2.6274 2.4956 2.4077 3.2989 2.8180 2.8184 2.8158 2.5244 2.9550 3.3327 3.5311 4.4954 6.3584 6.2972 1.5108 1.7520 1.7545 1.8657 1.6415 1.2367 3.5524 3.8169 2.4237 1.2504 1.2541 1.2860 1.3993 1.4729 1.4865 2.0876 1.3876 1.3874 6.2928 6.1125 1.3143 1.3164 2.6694 2.1943 2.6481 1.6363 1.6294 3.0406 2.1224 1.5534 1.4756 1.6878 2.3687 1.1114 1.0540 1.5593 1.1157 1.1184 1.5935 2.3418 2.1672 1.3186 1.2661 1.1561 1.2475 1.3549 1.2909 1.2829 1.4060 1.4123 1.4386 6.2662 7.8946 1.2862 2.1489 2.1762 1.1854 1.1510 1.1105 1.0687 1.1105 1.8045 1.7696 1.3971 1.0910 6.0373 6.0446 6.1837 6.1775 1.0787 1.0739 1.0637 1.0627 1.0609 1.0360 1.0829 1.0993 1.0970 1.1025 1.0993 1.0994 1.0869 1.0870 1.0867 1.0865 1.0907 1.0911 1.0958 1.0959 1.1015 1.1015 1.0736
irintensity: 0.0612 0.0032 0.0297 0.1313 0.1725 0.1418 0.0512 1.6219 0.4177 3.1535 0.0569 0.1516 0.4079 1.6101 0.1002 0.7604 0.5548 4.0340 0.0010 0.0028 0.6803 11.5892 33.5377 6.2183 4.7686 16.5751 0.0733 0.2223 53.8294 70.7889 28.6409 80.8804 21.1566 6.3347 0.4110 4.3568 1.7014 0.0175 0.0329 0.0785 1.7681 0.5502 4.8433 0.1006 0.1168 0.0154 0.0678 0.0420 0.1463 0.0727 1.5319 7.4214 11.6703 4.9133 1.1265 0.7933 6.9016 17.7910 1.2630 2.4034 36.4957 6.2310 0.3083 42.3827 0.2265 0.5849 4.8988 0.1354 6.0769 22.5145 5.5588 6.2625 0.4490 18.3508 0.3690 2.2277 12.2954 33.1533 3.2421 1.8925 0.1169 19.5365 7.0528 6.9121 28.2631 11.5902 8.3824 1.1371 16.8810 2.2781 30.9740 4.7045 9.4264 1.3405 1.4203 20.7475 1.8018 45.3967 147.6646 40.4931 2.8435 52.9407 12.8532 39.4468 0.8695 18.0224 56.8181 40.0895 34.2322 12.7673 8.2066 8.3748 4.7695 11.0501 13.1970 45.9714 48.1607 36.2351 14.4851 3.4196
temp: 298.150 k
press: 1.00000 atm
elementType: 7 6 6 6 6 6 6 6 6 6 6 6 6 6 6 6 6 6 6 1 1 1 1 1 1 1 1 1 1 1 1 1 1 1 1 1 1 1 1 1 1 1
symmnumber: 1
zpe: 949518.5 jmol-1
zpe.correction: 0.361652 hartree
zpe.thermalcorrener: 0.380496 hartree
zpe.thermalcorrenthalpy: 0.381440 hartree
zpe.thermalcorrgfe: 0.309005 hartree
zpe.sumelectzpe: -753.051057 hartree
zpe.sumelectthermal: -753.032213 hartree
zpe.sumelectthermalent: -753.031269 hartree
zpe.sumelectthermalfe: -753.103704 hartree
dipole: -0.1244 0.7780 0.4619
dipole: 0.9133
quadrupole: -112.3472 -106.5644 -119.4841
quadrupole: 0.8744 -4.8281 1.8370
quadrupole: 0.4514 6.2342 -6.6856 0.8744 -4.8281 1.8370
hfenergy: -753.4127092 hartree
pointgroup: C01 [X(C18H23N1)]
dipole: -0.050898 0.2961377 0.1970225 debye
polarizability: 275.3221416|6.3479855|184.48816|-28.5099952|15.0092272|130.7594683 unknown
InChI: InChI=1S/C18H23N/c1-16(15-18-11-6-3-7-12-18)19-14-8-13-17-9-4-2-5-10-17/h2-7,9-12,16,19H,8,13-15H2,1H3
charge 0 multiplicity 1
42 atoms
N  -0.419735 -0.267704 -0.260652
C  -1.815323 -0.305483 0.249887
C  -2.765193 -0.064397 -0.962014
C  0.656729 -0.287118 0.753673
C  2.033921 -0.109525 0.084962
C  3.201943 -0.146202 1.108198
C  -2.109202 -1.650709 0.94467
C  -4.226989 0.092426 -0.574709
C  4.560868 0.022234 0.44417
C  -5.157858 -0.9587 -0.777211
C  -4.69157 1.296957 0.017158
C  5.23223 -1.091282 -0.125247
C  5.169899 1.299563 0.34117
C  -6.512561 -0.814871 -0.398245
C  -6.043566 1.44685 0.397602
C  -6.960556 0.389225 0.191854
C  6.473892 -0.93432 -0.780904
C  6.411877 1.463056 -0.314087
C  7.068696 0.345416 -0.87891
H  -1.999962 0.513453 0.993901
H  -2.632697 -0.905765 -1.66772
H  -2.422312 0.853504 -1.484837
H  0.635674 -1.261855 1.277979
H  0.522908 0.502184 1.539605
H  -0.292257 0.529345 -0.902788
H  2.064693 0.855413 -0.46315
H  2.170695 -0.906272 -0.67061
H  3.045759 0.652378 1.860118
H  3.162018 -1.110972 1.652144
H  -3.168803 -1.703339 1.2493
H  -1.491851 -1.781893 1.850974
H  -1.891129 -2.485053 0.253036
H  -4.817367 -1.894151 -1.23815
H  -3.988905 2.125934 0.171703
H  4.779269 -2.088077 -0.048903
H  4.668516 2.170687 0.782105
H  -7.21645 -1.638223 -0.565854
H  -6.383681 2.386191 0.848781
H  -8.010583 0.504293 0.483546
H  6.978887 -1.807143 -1.210704
H  6.868094 2.457593 -0.380213
H  8.032984 0.468751 -1.38473
