program: Gaussian 09
title: 000042839
version: EM64L-G09RevD.01
frameworkgroup: C1[X(C12H3Cl5O)]
method: RPBEPBE
basis: SDD
operation: Freq
keyword: #p
keyword: freq=noraman
keyword: PBEPBE/SDD
title: #p freq=noraman PBEPBE/SDD
converged: NO NO NO NO
title: Mulliken charges:
elementType: Cl Cl Cl Cl Cl O C C C C C C C C C C C C H H H
charge: 0.029024 0.020252 0.007199 0.003548 0.015760 -0.228001 0.411053 0.243648 0.354793 0.179861 -0.339204 -0.338694 -0.346533 -0.328163 -0.133402 -0.226889 -0.107002 -0.082898 0.292049 0.290817 0.282782
chargesum: 0.00000
title: Mulliken charges with hydrogens summed into heavy atoms:
elementType: Cl Cl Cl Cl Cl O C C C C C C C C C C C C
charge: 0.029024 0.020252 0.007199 0.003548 0.015760 -0.228001 0.411053 0.243648 0.354793 0.179861 -0.339204 -0.046644 -0.346533 -0.037347 -0.133402 0.055894 -0.107002 -0.082898
polarizability: 3.08495284e+02 1.53160916e+00 2.11808451e+02 4.60796753e-03 1.49241082e-03 6.25919890e+01
1716.lowfreq: -0.0015 -0.0008 0.0008 0.9935 3.6110 3.7191 47.5669 49.0343 74.6324
frequency: 47.5491 49.0028 74.6323 89.2847 135.3980 151.0517 165.2526 184.8504 190.6157 217.7984 222.8983 268.5809 307.5612 319.9603 355.0339 359.3471 385.6509 386.2382 433.8235 449.1848 523.5059 542.7919 579.4710 605.3052 624.2243 629.3856 659.5381 690.6171 708.7938 753.6742 759.1441 825.6703 852.5209 863.6241 887.2200 891.6191 916.2387 1035.1892 1086.1545 1130.6005 1168.9340 1210.5164 1223.4498 1238.2266 1313.9112 1363.4206 1385.2164 1402.3555 1411.9079 1456.9316 1555.9848 1582.2202 1589.8689 1630.7862 3172.4681 3181.6213 3183.7172
redmass: 21.6948 21.3900 20.5644 24.3633 10.1269 28.7960 8.3478 31.5690 29.5412 6.8806 17.1424 21.2780 8.1172 28.4907 13.9639 9.2949 11.3338 15.4333 3.0222 9.2423 8.9454 5.0112 7.5272 10.2144 7.5607 8.6946 7.8999 10.3387 4.7752 6.9502 12.2350 6.4703 1.4163 1.4264 11.2145 1.4392 10.8216 7.5843 1.8571 4.1260 3.5017 3.1689 1.3557 4.6899 7.9622 4.7606 10.1356 5.9935 4.5245 4.8195 9.5019 9.7853 10.2522 9.6606 1.0927 1.0933 1.0940
irintensity: 0.0007 0.0005 0.0276 0.0095 0.0263 0.1876 0.2275 0.0219 0.0062 0.5504 0.4250 0.3359 0.0308 0.0369 0.2443 1.8559 2.8584 5.7000 9.0940 9.2720 20.6554 8.4693 22.5240 0.0187 0.9037 1.5934 10.7379 20.5228 1.2478 0.0139 60.3077 11.4720 18.1346 17.7458 22.7274 33.7890 53.9636 150.5865 86.9208 23.5548 10.4548 48.4436 1.7100 7.8902 67.6292 64.3154 26.6910 61.7021 95.8225 74.5394 8.3847 14.9307 8.4315 30.7124 3.9383 2.8399 0.4472
temp: 298.150 k
press: 1.00000 atm
elementType: 17 17 17 17 17 8 6 6 6 6 6 6 6 6 6 6 6 6 1 1 1
symmnumber: 1
zpe: 295660.3 jmol-1
zpe.correction: 0.112611 hartree
zpe.thermalcorrener: 0.128100 hartree
zpe.thermalcorrenthalpy: 0.129044 hartree
zpe.thermalcorrgfe: 0.068004 hartree
zpe.sumelectzpe: -2833.362945 hartree
zpe.sumelectthermal: -2833.347456 hartree
zpe.sumelectthermalent: -2833.346512 hartree
zpe.sumelectthermalfe: -2833.407552 hartree
dipole: 1.0882 0.6426 0.0000
dipole: 1.2637
quadrupole: -140.9439 -137.5604 -138.1212
quadrupole: -0.2885 0.0007 0.0004
quadrupole: -2.0687 1.3148 0.7540 -0.2885 0.0007 0.0004
hfenergy: -2833.475556 hartree
pointgroup: C01 [X(C12H3Cl5O1)]
dipole: -0.4281916 -0.2526928 0.0000139 debye
dipolederiv: -0.0726699 -0.1838716 0.0000053 -0.0135769 -0.6137378 0.000016 -0.0000047 -0.0000323 -0.0005429 -0.1532514 -0.1758479 0.0000152 -0.2596726 -0.6827384 0.0000449 0.0000609 0.0001326 -0.0036442 -0.5278706 0.3160736 0.0000329 0.3986253 -0.3225298 -0.0000233 0.0000146 -0.0000184 -0.0193673 -0.4589346 -0.2858089 0.0000248 -0.4366161 -0.3557416 0.0000303 0.0000839 0.0000558 -0.0226074 -0.8354741 0.1919879 0.000043 0.2760294 -0.1152198 -0.0000175 0.0001139 -0.0000303 -0.0167762 -1.3360739 0.0239201 -0.0000039 0.0249746 -0.4525068 -0.0000012 -0.0000779 -0.0000061 -0.1319291 0.2306678 -0.2126202 0.0000237 0.1904103 -0.2318142 0.0000166 0.0000255 -0.0000311 0.0528422 0.0547991 0.1275212 0.0000135 -0.1695625 -0.1009374 -0.0000051 -0.0000013 0.000004 0.0023546 0.483361 -0.2588059 0.0000103 -0.8601857 -0.0047635 0.0000036 0.0000269 0.0000563 0.1087032 0.7558772 0.2093969 0.0000119 0.5693009 0.2703246 0.0000117 0.0000154 0.0000122 0.0758647 -0.0153143 0.3708765 -0.0000111 0.1332963 0.8337507 -0.0000332 -0.0000014 0.000052 -0.0710789 0.0084715 -0.2032561 0.000029 0.0338171 -0.0821643 -0.0000071 0.000034 0.0000106 -0.077915 0.3031813 0.3349893 -0.0000327 0.5026485 1.0877561 -0.0000939 -0.0001059 -0.0002209 -0.0997585 -0.3543622 -0.033775 0.0000237 -0.0670505 -0.0535095 0.0000082 0.0000549 -0.0000137 -0.1018386 0.6883443 -0.5265784 -0.0000592 -0.7682312 0.3185211 0.0000559 -0.0000161 0.0000089 -0.0469261 -0.3546176 0.0211455 -0.0000033 0.1253694 -0.2900474 0.0000188 0.000016 0.0000398 -0.0564376 0.2989536 0.6815972 -0.0000439 0.8578769 0.437885 -0.0000555 -0.0000814 -0.0001108 -0.0576493 1.0311645 -0.4093704 -0.000089 -0.5412835 0.1894278 0.0000327 -0.0001762 0.000086 -0.0591822 0.1181252 0.0374808 -0.0000051 -0.0003844 0.0375924 0.0000076 -0.0000143 0.0000166 0.1674608 0.0889905 -0.0034327 0.0000012 0.0141398 0.0410136 -0.000005 0.0000047 -0.0000129 0.1881881 0.0466325 -0.0216219 0.0000136 -0.0099252 0.0894394 -0.0000046 0.0000285 0.0000019 0.1702398 unknown
polarizability: 308.4961149|1.5051622|211.8076206|-0.0046084|-0.0014912|62.591989 unknown
InChI: InChI=1S/C12H3Cl5O/c13-5-1-4-9(3-6(5)14)18-12-8(16)2-7(15)11(17)10(4)12/h1-3H
charge 0 multiplicity 1
21 atoms
Cl -1.316445 3.03979 -0.000078
Cl -2.967034 -3.21196 0.000114
Cl -4.463852 2.124361 0.000196
Cl 4.321476 2.14319 -0.000078
Cl 5.115825 -1.021913 -0.000111
O  -0.05904 -1.929625 -0.000001
C  -0.781433 0.303688 -0.000052
C  0.680697 0.299098 0.00002
C  -1.174702 -1.070647 -0.00005
C  1.06658 -1.076694 0.000065
C  -1.782063 1.302017 -0.000086
C  1.689677 1.287385 0.00008
C  -2.517534 -1.474721 -0.000111
C  2.394519 -1.510791 0.000093
C  -3.13718 0.900183 0.00006
C  -3.503845 -0.469527 -0.000009
C  3.036512 0.873613 0.000111
C  3.386591 -0.507713 0.000099
H  1.448267 2.352857 -0.000006
H  2.656802 -2.571428 0.000039
H  -4.563117 -0.742464 0.000104
