program: Gaussian 09
title: 000042858
version: EM64L-G09RevD.01
frameworkgroup: C1[X(C15H14O4S)]
method: RPBEPBE
basis: SDD
operation: Freq
keyword: #p
keyword: freq=noraman
keyword: PBEPBE/SDD
title: #p freq=noraman PBEPBE/SDD
converged: YES YES NO NO
title: Mulliken charges:
elementType: S O O O O C C C C C C C C C C C C C C C H H H H H H H H H H H H H H
charge: 0.809515 -0.532159 -0.548053 -0.424267 -0.232616 -0.079156 0.312229 -0.134888 0.340135 -0.315777 0.286866 -0.854826 -0.420601 -0.239423 -0.241759 -0.831740 -0.333892 -0.233372 -0.215411 0.127105 0.313286 0.280183 0.251353 0.248863 0.236125 0.240927 0.315659 0.236131 0.233225 0.239266 0.279930 0.247404 0.244602 0.395134
chargesum: 0.00000
title: Mulliken charges with hydrogens summed into heavy atoms:
elementType: S O O O O C C C C C C C C C C C C C C C
charge: 0.809515 -0.532159 -0.548053 -0.029134 -0.232616 -0.079156 0.312229 -0.134888 0.340135 -0.002491 0.286866 -0.074427 -0.184475 0.001504 0.073900 -0.123118 -0.053962 0.014032 0.029192 0.127105
polarizability: 2.48765098e+02 2.36617278e+01 2.05665076e+02 4.10427678e+00 5.57717943e+00 1.43101218e+02
1716.lowfreq: -7.7616 -0.0010 -0.0009 0.0006 0.5992 7.5782 26.6121 38.4486 54.1483
frequency: 26.5418 38.3592 54.1336 57.7021 100.9474 108.3855 126.1730 144.9192 160.3945 166.3121 181.4618 196.4012 221.9667 237.7846 245.0824 265.9947 273.3446 314.6744 336.3759 368.1518 383.0944 415.2712 434.2766 465.2318 493.6918 506.6060 508.2784 525.5581 542.5243 574.1829 594.9916 598.7873 636.3028 680.0175 717.2265 746.9719 753.8683 758.2436 788.3629 794.1372 799.7350 817.3135 906.2456 914.0121 931.3417 978.6074 983.4284 990.8604 993.2437 995.1118 1011.5212 1018.0887 1033.0638 1053.6407 1056.8003 1084.7651 1114.0772 1139.4542 1162.0603 1174.3862 1179.7418 1210.2988 1254.6886 1261.2723 1321.7895 1361.2986 1378.7845 1396.1130 1405.1549 1419.1756 1422.9085 1455.4065 1458.3651 1463.7402 1476.1912 1484.2331 1493.0855 1564.1531 1565.6745 1602.2079 1613.2917 1645.9366 2978.6825 2983.8565 3056.1097 3064.1390 3089.7802 3113.7909 3129.1069 3131.6767 3143.1424 3145.3036 3157.4656 3162.9360 3173.3838 3537.8021
redmass: 6.0005 4.9363 5.6015 5.4681 1.2269 3.0884 3.7844 7.3745 5.7826 4.1110 1.2087 4.8302 6.2097 5.3047 4.6436 6.2257 5.4848 7.3270 2.6150 7.2884 7.8436 3.7231 4.0989 5.0664 4.7189 4.7899 3.1638 4.6766 4.5909 1.4946 4.3677 4.5563 6.7321 4.3592 2.8029 3.1651 4.8716 4.8792 9.5720 1.5361 1.3451 4.6688 5.2754 1.6308 1.3212 2.1023 2.7001 1.5865 1.4614 1.4679 1.4127 3.5795 1.4360 2.0716 1.6316 1.8829 1.8358 2.1434 1.6406 1.0687 1.4641 2.3664 1.4507 1.8353 2.8180 6.1965 6.6388 1.2302 1.2131 2.2350 2.3342 2.5466 1.8285 1.1531 1.3614 1.0637 1.0746 5.7026 5.8612 6.8860 7.1771 9.7083 1.0379 1.0405 1.0974 1.0957 1.0983 1.0967 1.0876 1.0884 1.0906 1.0884 1.0935 1.0994 1.1005 1.0645
irintensity: 0.7983 0.4811 1.8648 1.0760 0.2437 1.2530 0.1138 2.5335 1.1165 2.6808 1.2202 3.5956 1.6576 3.8974 6.2488 0.3239 1.9754 5.1506 1.4203 26.6585 24.7880 24.1926 26.3507 29.6062 11.1943 15.3626 3.3617 35.8022 9.0770 59.6926 17.2459 25.7131 18.5793 47.8175 11.3677 18.6450 0.9307 25.1881 73.0543 46.8441 33.5210 3.3889 59.0969 17.7794 3.3495 0.4214 7.2558 3.9023 2.6091 6.4966 0.3956 92.7606 13.5879 47.2169 0.8781 11.1464 15.2270 3.0748 68.1138 0.1947 0.4271 20.1555 3.0392 2.1757 114.7718 4.0890 2.6755 5.1408 20.0719 9.0409 32.2696 4.6018 1.3875 26.1663 27.9201 10.7385 32.9544 12.8865 10.0595 24.9472 1.3054 320.1325 24.8154 12.8848 17.5755 9.6411 20.2352 11.9893 14.5024 12.2859 3.4464 0.2767 4.3503 27.5553 22.5152 47.6463
temp: 298.150 k
press: 1.00000 atm
elementType: 16 8 8 8 8 6 6 6 6 6 6 6 6 6 6 6 6 6 6 6 1 1 1 1 1 1 1 1 1 1 1 1 1 1
symmnumber: 1
zpe: 663934.5 jmol-1
zpe.correction: 0.252879 hartree
zpe.thermalcorrener: 0.272309 hartree
zpe.thermalcorrenthalpy: 0.273253 hartree
zpe.thermalcorrgfe: 0.204682 hartree
zpe.sumelectzpe: -1277.358713 hartree
zpe.sumelectthermal: -1277.339283 hartree
zpe.sumelectthermalent: -1277.338339 hartree
zpe.sumelectthermalfe: -1277.406911 hartree
dipole: 1.7374 -2.1857 -5.7516
dipole: 6.3935
quadrupole: -103.9205 -118.5823 -138.2792
quadrupole: 15.9776 -0.7383 5.4289
quadrupole: 16.3402 1.6784 -18.0185 15.9776 -0.7383 5.4289
hfenergy: -1277.6115925 hartree
pointgroup: C01 [X(C15H14O4S1)]
dipole: -0.7518001 1.1328535 -2.1162921 debye
polarizability: 248.4279806|24.2005176|206.2449084|-4.3229484|1.6014711|142.8585041 unknown
InChI: InChI=1S/C15H14O4S/c1-10-6-5-9-13(11(10)2)20(18,19)14-8-4-3-7-12(14)15(16)17/h3-9,16H,1-2H3
charge 0 multiplicity 1
34 atoms
S  0.176468 -0.060591 1.468303
O  0.531869 -1.522275 2.104034
O  0.053465 1.229707 2.477598
O  0.422869 -1.88611 -0.894723
O  2.501652 -2.643054 -1.607049
C  -1.508493 -0.222837 0.565131
C  -2.074698 0.863823 -0.135386
C  1.648296 0.448391 0.27628
C  -3.373544 0.639785 -0.69898
C  -2.11903 -1.468069 0.767142
C  2.277207 -0.40421 -0.661963
C  -1.353282 2.19103 -0.290251
C  -4.010504 -0.613106 -0.511096
C  -3.403108 -1.659138 0.217874
C  2.16511 1.710703 0.60299
C  -4.084183 1.727662 -1.487764
C  3.47592 0.056034 -1.271569
C  3.345399 2.158994 -0.033807
C  4.003825 1.326583 -0.966789
C  1.794128 -1.751349 -1.087362
H  -1.597972 -2.23941 1.344331
H  -0.945353 2.523939 0.680276
H  -0.505433 2.104204 -0.996428
H  -2.022534 2.975291 -0.673733
H  -5.007004 -0.766741 -0.94143
H  -3.923955 -2.611842 0.358572
H  1.663052 2.302586 1.377493
H  -3.479201 2.078019 -2.344383
H  -5.044264 1.356728 -1.883975
H  -4.302243 2.612148 -0.859761
H  3.972458 -0.611421 -1.983614
H  3.75347 3.143885 0.2158
H  4.926902 1.663004 -1.449679
H  0.12641 -2.80906 -1.114582
