program: Gaussian 09
title: 000042836
version: EM64L-G09RevD.01
frameworkgroup: C1[X(C12H3Cl5O2)]
method: RPBEPBE
basis: SDD
operation: Freq
keyword: #p
keyword: freq=noraman
keyword: PBEPBE/SDD
title: #p freq=noraman PBEPBE/SDD
converged: NO NO NO YES
title: Mulliken charges:
elementType: Cl Cl Cl Cl Cl O O C C C C C C C C C C C C H H H
charge: 0.052475 0.014501 0.015550 0.013299 0.013111 -0.257189 -0.251729 0.459772 0.434366 0.268823 0.278274 -0.334814 -0.359497 -0.342070 -0.343324 -0.109221 -0.259614 -0.085959 -0.084783 0.295064 0.294737 0.288229
chargesum: 0.00000
title: Mulliken charges with hydrogens summed into heavy atoms:
elementType: Cl Cl Cl Cl Cl O O C C C C C C C C C C C C
charge: 0.052475 0.014501 0.015550 0.013299 0.013111 -0.257189 -0.251729 0.459772 0.434366 0.268823 0.278274 -0.334814 -0.359497 -0.047007 -0.048586 -0.109221 0.028614 -0.085959 -0.084783
polarizability: 3.16458892e+02 -3.17756190e+00 2.11849647e+02 -1.39332183e-04 5.10503948e-03 6.36314745e+01
1716.lowfreq: 0.0019 0.0028 0.0029 3.1825 3.9871 5.6022 26.3444 43.1982 73.3397
frequency: 26.3400 43.1978 73.3386 92.5219 130.9364 137.2763 155.0172 155.7666 180.8427 188.9840 201.9398 245.6619 264.9621 284.6496 316.7308 333.8201 338.3355 366.5443 393.6489 430.8387 443.9613 516.6438 519.5191 522.8866 562.8607 580.7086 581.9032 590.3806 639.1965 658.5677 681.1660 695.9537 758.4411 795.1173 838.7777 845.2087 871.5601 877.5317 908.4336 931.2435 1098.1417 1103.6051 1114.2039 1174.9628 1214.6408 1221.6743 1266.0188 1351.5514 1358.3206 1371.0314 1398.0674 1420.9372 1465.6290 1561.2069 1568.9702 1593.8292 1623.0889 3182.3506 3185.4696 3187.2729
redmass: 17.7772 19.7991 25.5785 24.0132 10.0839 11.3646 11.0351 29.1821 29.0185 29.3970 17.5890 7.6872 21.5303 6.9671 27.3446 14.2673 11.8595 12.2276 16.2796 11.1419 3.0950 8.2424 11.7928 5.0582 7.1414 11.3025 10.8696 11.9752 9.3054 4.0962 8.6468 6.9281 8.7734 8.5232 1.3997 1.4248 1.3835 10.1938 9.1311 11.2000 1.6889 8.5239 6.1083 1.9183 4.7133 1.2892 5.9496 8.3692 10.7118 8.5041 9.5131 4.3550 3.9408 9.9486 9.6959 10.4846 9.2166 1.0927 1.0932 1.0933
irintensity: 0.0330 0.0146 0.0051 0.0124 0.0184 0.0451 1.0534 0.1161 0.0487 0.0387 0.3541 0.0022 0.0926 0.2652 0.0709 0.1131 0.2648 2.6307 9.9550 2.1692 9.8916 18.1275 3.5913 8.9245 1.2260 2.2262 6.8110 0.3864 4.7474 0.0637 9.8591 0.8874 27.0400 70.9452 20.4737 0.1232 54.3466 14.6457 148.8196 134.3173 104.8348 28.1944 30.1031 20.7607 0.5433 0.2691 127.6528 57.3101 51.4365 34.8640 289.3899 423.4722 438.7170 35.0875 2.8956 4.6475 5.0169 4.4468 2.0423 3.5698
temp: 298.150 k
press: 1.00000 atm
elementType: 17 17 17 17 17 8 8 6 6 6 6 6 6 6 6 6 6 6 6 1 1 1
symmnumber: 1
zpe: 302908.7 jmol-1
zpe.correction: 0.115372 hartree
zpe.thermalcorrener: 0.132116 hartree
zpe.thermalcorrenthalpy: 0.133061 hartree
zpe.thermalcorrgfe: 0.068941 hartree
zpe.sumelectzpe: -2908.471669 hartree
zpe.sumelectthermal: -2908.454924 hartree
zpe.sumelectthermalent: -2908.453980 hartree
zpe.sumelectthermalfe: -2908.518100 hartree
dipole: 0.8047 0.6700 0.0000
dipole: 1.0472
quadrupole: -149.4597 -142.1192 -143.4375
quadrupole: 3.5044 0.0003 0.0000
quadrupole: -4.4542 2.8863 1.5680 3.5044 0.0003 0.0000
hfenergy: -2908.5870408 hartree
pointgroup: C01 [X(C12H3Cl5O2)]
dipole: -0.3235992 0.2549817 -0.0000104 debye
dipolederiv: -0.0018676 -0.0123468 0.0000008 -0.1148215 -0.6121084 0.0000549 0.0000082 0.0000517 0.0155295 -0.0634821 -0.0202714 -0.0000014 0.0431169 -0.696526 0.0000039 -0.0000018 0.0000082 -0.0119043 -0.7104749 -0.244237 -0.0000315 -0.2739696 -0.1578685 -0.0000117 -0.0000565 -0.0000157 -0.0156491 -0.5735394 0.2936441 -0.0000257 0.39624 -0.2719136 0.0000193 -0.0000402 0.0000214 -0.016192 -0.6541091 -0.2575361 0.0000305 -0.349206 -0.1976048 0.0000172 0.000041 0.0000172 -0.0164789 -2.1451476 0.0833092 0.0000285 0.1219424 -0.3126635 -0.0000041 0.0000634 -0.0000049 -0.1317489 -2.1722945 0.0550758 0.0000244 0.1086451 -0.3110393 0.0000077 0.0000295 0.0000119 -0.1269141 1.223635 -0.1423172 -0.0000396 -1.0312486 0.0314759 0.0000502 -0.0000448 0.0000266 0.1374083 1.2869154 0.0699436 -0.0000306 0.9706438 -0.1979807 -0.0000196 -0.0000708 -0.0000063 0.0931244 1.3604184 0.0910584 -0.0000143 0.8718365 0.0922793 -0.0000118 -0.0000399 0.0000011 0.0696281 1.261609 -0.1993446 0.0000045 -1.0243936 0.1961309 0.0000069 0.0000231 -0.0000101 0.0735504 -0.412057 0.0337262 -0.0000115 0.0685377 0.9122843 -0.0001162 -0.0000209 -0.0001106 -0.0992647 0.0080895 0.0412664 0.0000105 -0.110635 1.1152965 -0.0000031 0.0000288 0.0000002 -0.098471 -0.3856481 0.089313 -0.0000077 0.101668 -0.0729287 0.0000093 -0.0000023 0.0000079 -0.0896772 -0.4264732 -0.0571265 0.0000164 -0.0682436 -0.0520541 0.000004 0.0000149 0.0000019 -0.0912765 1.043082 0.2629639 0.0000736 0.4362936 0.1179882 0.0000528 0.0001132 0.000051 -0.0439341 -0.3353122 -0.0601715 -0.0000192 -0.1049443 -0.3369108 -0.0000129 -0.0000321 -0.0000026 -0.056261 0.6360232 -0.5827693 0.0000695 -0.6728539 0.359613 -0.0000321 0.0000986 -0.0000347 -0.0640052 0.7972406 0.5386822 -0.0000743 0.6174431 0.2206598 -0.0000239 -0.0000945 -0.000023 -0.0630771 0.0987314 -0.0284836 0. -0.021321 0.053126 0.0000028 -0.0000094 0.0000081 0.1812041 0.1032924 0.0225277 -0.0000003 0.0144757 0.0479347 0.0000034 0.0000067 0.0000063 0.1814294 0.0613687 0.0230934 -0.0000025 0.0207945 0.0728097 0.000003 -0.0000143 -0.0000058 0.17298 unknown
polarizability: 316.2116499|5.9916277|212.0968892|-0.0000017|-0.0051069|63.6314745 unknown
InChI: InChI=1S/C12H3Cl5O2/c13-4-2-8-9(3-5(4)14)19-12-10(17)6(15)1-7(16)11(12)18-8/h1-3H
charge 0 multiplicity 1
22 atoms
Cl -2.574456 -2.982013 0.000292
Cl -2.233556 3.429601 0.000028
Cl -5.31203 -1.170805 -0.000061
Cl 5.049909 -1.876854 0.000133
Cl 5.253838 1.40948 -0.000122
O  -0.101148 -1.369385 0.000022
O  0.07899 1.54108 -0.000037
C  -1.251759 -0.550177 0.000071
C  -1.162045 0.865471 0.000026
C  1.147146 -0.693181 -0.000001
C  1.234276 0.71884 -0.000005
C  -2.510206 -1.186356 0.000134
C  -2.342683 1.630034 0.000039
C  2.30828 -1.47586 0.00002
C  2.48387 1.351283 -0.000017
C  -3.682836 -0.395572 0.00006
C  -3.606744 1.009286 0.000023
C  3.570206 -0.842778 0.000027
C  3.657426 0.566599 -0.00002
H  2.224998 -2.565282 0.000044
H  2.536261 2.44273 -0.000045
H  -4.517437 1.612257 -0.000012
