program: Gaussian 09
title: 000042817
version: EM64L-G09RevD.01
frameworkgroup: C1[X(C9H10BrNO2)]
method: RPBEPBE
basis: SDD
operation: Freq
keyword: #p
keyword: freq=noraman
keyword: PBEPBE/SDD
title: #p freq=noraman PBEPBE/SDD
converged: YES YES NO NO
title: Mulliken charges:
elementType: Br O O N C C C C C C C C C H H H H H H H H H H
charge: 0.003315 -0.286213 -0.267251 -0.615378 0.354016 0.014730 0.218119 -0.335728 -0.341962 -0.213575 -0.803357 0.155572 -0.521206 0.258126 0.277281 0.226340 0.233977 0.260702 0.202970 0.229543 0.279593 0.333685 0.336700
chargesum: 0.00000
title: Mulliken charges with hydrogens summed into heavy atoms:
elementType: Br O O N C C C C C C C C C
charge: 0.003315 -0.286213 -0.267251 0.055006 0.354016 0.014730 0.218119 -0.077602 -0.064681 -0.213575 -0.082338 0.155572 0.190900
polarizability: 1.80023980e+02 4.50480900e+00 1.37522185e+02 4.12175833e+00 2.11214957e+00 6.72813161e+01
1716.lowfreq: -6.5324 -0.0005 0.0006 0.0006 6.1135 8.1216 59.2678 65.9396 76.6523
frequency: 59.2608 65.9292 76.6239 104.9043 119.0820 145.9784 167.7922 192.5134 197.1872 210.0879 259.9615 295.1418 324.7467 342.3987 438.7928 447.9064 513.8646 525.2834 550.6338 572.7417 606.0549 616.0527 650.4285 734.5261 779.9596 809.3131 884.0770 896.1871 909.4575 945.4567 1001.1376 1047.3968 1059.1226 1101.3094 1115.4140 1151.4314 1171.9354 1209.9794 1247.4576 1334.5190 1359.1424 1395.1270 1400.0941 1407.9139 1447.7594 1451.8559 1460.6767 1478.9971 1487.7104 1566.7772 1581.3992 1585.2662 1630.0877 2967.8960 2982.3024 3065.1795 3078.0297 3103.2766 3125.4448 3154.2185 3159.0135 3515.6826 3671.5052
redmass: 4.9427 2.2439 1.7231 2.7656 5.9330 3.5459 1.1297 4.2589 3.6627 3.4702 10.7467 4.2965 4.9675 5.1394 4.1727 3.9893 4.1600 1.1806 3.5098 3.0617 1.5354 5.2621 3.3903 6.0815 5.3566 6.7520 1.3786 1.4315 5.2425 8.7301 1.5810 1.5369 1.8213 1.8809 1.2386 1.4313 4.1275 2.2641 1.7912 4.0984 6.3618 1.4912 2.4325 1.8617 1.6668 1.0654 1.0560 1.1299 1.0708 5.0333 6.4041 2.0660 2.4527 1.0329 1.0396 1.0929 1.1004 1.1005 1.1039 1.0926 1.0925 1.0448 1.1045
irintensity: 7.6657 1.1587 5.0839 1.3033 1.0257 8.7968 0.2352 2.9449 6.0460 4.8056 1.1863 5.2494 9.9337 2.2862 3.4799 9.1103 10.3424 125.6659 13.2528 18.2540 88.0277 14.4957 53.6628 5.4583 27.0798 33.6474 18.1606 7.6099 16.2506 35.4923 5.2210 6.7982 0.3798 2.6105 3.5652 13.0996 142.3127 24.1160 8.5620 166.1460 46.7607 19.8433 21.0308 27.1110 72.9776 15.8122 12.5333 21.0030 32.0643 53.2886 5.0760 92.3505 290.2690 73.0825 30.1589 19.3753 21.2479 8.0485 18.8288 3.4514 0.2451 44.6255 27.4568
temp: 298.150 k
press: 1.00000 atm
elementType: 35 8 8 7 6 6 6 6 6 6 6 6 6 1 1 1 1 1 1 1 1 1 1
symmnumber: 1
zpe: 454326.2 jmol-1
zpe.correction: 0.173044 hartree
zpe.thermalcorrener: 0.186835 hartree
zpe.thermalcorrenthalpy: 0.187780 hartree
zpe.thermalcorrgfe: 0.131437 hartree
zpe.sumelectzpe: -566.657515 hartree
zpe.sumelectthermal: -566.643723 hartree
zpe.sumelectthermalent: -566.642779 hartree
zpe.sumelectthermalfe: -566.699122 hartree
dipole: -0.2920 0.3457 -1.3314
dipole: 1.4062
quadrupole: -93.9649 -68.7697 -87.3339
quadrupole: 3.7330 -0.2254 8.7154
quadrupole: -10.6087 14.5865 -3.9777 3.7330 -0.2254 8.7154
hfenergy: -566.8305584 hartree
pointgroup: C01 [X(C9H10Br1N1O2)]
dipole: 0.1620945 -0.124204 -0.514182 debye
dipolederiv: -0.5724969 -0.309358 -0.0098146 -0.337868 -0.2872015 -0.0076523 -0.0164543 -0.0126231 -0.0419968 -1.0513287 -0.5036002 0.2132449 -0.4628763 -0.7579255 0.1647301 0.1110991 0.08941 -0.4128281 -0.9190819 -0.0323118 0.3123776 0.1178607 -0.5613528 0.1638725 0.1550903 0.2797572 -0.6975416 -0.4356094 0.0592351 -0.245721 0.0560327 -0.9572493 0.3170945 -0.2217846 0.2736115 -0.7740941 -0.1466028 -0.1473088 0.0248531 -0.0367474 0.3458962 0.0133669 -0.0084781 -0.0429359 -0.0243221 0.7865266 0.5954222 -0.082388 0.3802885 0.412812 -0.0688899 0.1506957 0.0584718 -0.0492093 -0.3473677 0.1571473 0.029007 0.0796581 -0.0753621 0.045069 -0.013824 0.0382682 -0.0464081 -0.1882129 -0.2491474 0.0004701 -0.1070634 -0.200571 -0.0140603 0.0114705 0.0035585 -0.1056549 -0.2603156 -0.1879441 0.0120633 -0.1191405 -0.1780439 0.0247927 -0.0761479 0.0641434 -0.1160616 0.9455302 0.6368043 0.0164088 0.6138226 0.3854346 0.0242755 0.0374118 0.0222598 -0.1140855 0.0182717 -0.033599 -0.0209716 -0.0028648 -0.180312 -0.0010543 -0.0478907 0.0538149 0.0555522 1.2017594 -0.2843682 -0.2031202 -0.4247175 0.9759555 -0.6634112 -0.0519053 -0.6998948 1.0112491 0.4862452 0.156836 -0.1337376 0.1572478 0.3459691 -0.1310136 -0.3034125 -0.2870127 0.4289641 -0.024462 0.0571562 -0.0028358 0.0684855 0.0639922 -0.0013227 -0.0010069 -0.0030713 0.150876 0.1015126 0.0196694 0.0013284 0.0061137 -0.0334209 -0.0002036 0.0181727 -0.0040819 0.1510948 -0.093958 0.1045737 0.0824619 0.0128767 0.0533791 -0.0062621 0.0696905 -0.0470836 0.0868242 0.1113415 -0.0112317 0.0399569 0.0030005 -0.0116054 0.0495976 0.02581 0.1005694 -0.0861007 0.0343474 -0.0757063 -0.0939513 -0.0371239 0.0371127 -0.0221903 -0.0582512 -0.0642487 0.0527439 -0.0370068 0.1168627 -0.1099113 0.0330852 -0.0164059 0.1129008 0.00495 0.1246968 -0.0507085 -0.0542298 -0.1365348 -0.0145576 -0.1445783 -0.0049045 -0.008715 -0.0379177 -0.035576 0.0586441 0.0582396 0.0044744 0.0460529 0.0747183 0.0883652 -0.1143181 0.0794626 -0.017511 0.0281084 0.1910573 0.0287512 0.0748686 0.0108975 0.2911999 0.0468508 0.1121342 0.0378128 0.2409818 0.1958411 0.0341778 0.0639154 0.0588924 0.2642382 0.0765432 0.0610859 0.0676649 0.2539727 unknown
polarizability: 169.378987|18.6511346|146.8373321|-4.369029|-10.9408775|68.611162 unknown
InChI: InChI=1S/C9H10BrNO2/c1-5-3-6(10)4-7(9(11)12)8(5)13-2/h3-4H,11H2,1-2H3
charge 0 multiplicity 1
23 atoms
Br 3.589383 1.86839 -0.038165
O  -1.477421 -1.654515 -0.324454
O  -2.73281 0.927993 0.670139
N  -1.970044 2.260379 -1.069388
C  0.945462 -1.467964 -0.124858
C  -0.336113 -0.84582 -0.158679
C  -0.45693 0.571726 -0.162905
C  2.100189 -0.647554 -0.090557
C  0.710289 1.377365 -0.134838
C  1.969867 0.754194 -0.091533
C  1.067323 -2.978451 -0.151743
C  -1.814126 1.23892 -0.146345
C  -2.143485 -2.104652 0.922961
H  3.092148 -1.109523 -0.069573
H  0.62656 2.468085 -0.112397
H  2.053821 -3.293066 -0.531632
H  0.948053 -3.408203 0.861759
H  0.278275 -3.417499 -0.78513
H  -1.437661 -2.670086 1.562574
H  -2.959145 -2.764186 0.590099
H  -2.547397 -1.227394 1.456075
H  -1.278889 2.436494 -1.796625
H  -2.854849 2.767968 -1.084484
