program: Gaussian 09
title: 000042823
version: EM64L-G09RevD.01
frameworkgroup: C1[X(C13H16ClNO2)]
method: RPBEPBE
basis: SDD
operation: Freq
keyword: #p
keyword: freq=noraman
keyword: PBEPBE/SDD
title: #p freq=noraman PBEPBE/SDD
converged: YES YES NO NO
title: Mulliken charges:
elementType: Cl O O N C C C C C C C C C C C C C H H H H H H H H H H H H H H H H
charge: -0.071725 -0.259061 -0.276736 -0.374426 0.182827 0.066369 0.341250 -0.368917 -0.393251 0.153575 -0.115402 -0.786200 -0.340280 -0.331849 -0.651440 -0.068425 -0.552093 0.274254 0.264446 0.213653 0.250480 0.237094 0.316173 0.216460 0.258292 0.272650 0.205613 0.236219 0.204978 0.222089 0.227572 0.220027 0.225781
chargesum: 0.00000
title: Mulliken charges with hydrogens summed into heavy atoms:
elementType: Cl O O N C C C C C C C C C C C C C
charge: -0.071725 -0.259061 -0.276736 -0.058253 0.182827 0.066369 0.341250 -0.094664 -0.128804 0.153575 -0.115402 -0.084972 0.134473 0.146414 0.011845 0.159148 -0.106285
polarizability: 2.30881944e+02 3.56529822e+00 1.90989528e+02 -1.15203028e+01 -2.32719751e+00 9.59401023e+01
1716.lowfreq: -28.8075 -8.6470 -3.8767 -0.0027 -0.0023 -0.0021 3.7422 30.5060 42.4250
frequency: -28.0694 30.3883 42.3801 62.7856 73.6061 81.0928 105.8144 124.4130 136.8955 161.3923 167.3456 191.6396 211.0667 216.7345 252.8381 283.4747 287.4875 322.6049 334.6536 375.3015 392.5048 430.6459 439.5696 506.5376 528.9428 556.3100 563.2201 593.6859 626.0265 675.9142 716.0905 744.3572 762.3943 795.5510 846.8967 872.0941 878.0886 892.4733 914.5133 934.9702 952.1216 964.4824 983.1454 1006.7745 1011.1052 1047.1505 1066.7446 1096.7647 1108.2320 1140.9937 1144.6714 1178.0015 1204.0603 1224.8396 1242.1503 1266.9825 1280.8046 1282.3697 1337.3936 1352.2779 1378.3764 1388.0523 1398.9643 1403.7836 1416.6198 1434.1545 1453.9437 1464.5469 1468.3145 1472.1637 1476.2881 1479.4234 1488.8140 1574.5694 1587.0650 1596.8720 1662.1230 2954.2408 2982.4404 2987.4044 2993.7945 3066.0501 3066.9246 3074.4531 3085.2156 3092.5722 3096.2999 3096.6640 3115.9125 3155.9452 3159.3434 3203.2074 3544.3491
redmass: 2.3157 5.0735 4.3574 3.4808 3.1650 3.1722 4.7022 2.6730 1.2158 3.5421 4.7960 2.6185 2.5150 2.2018 4.3895 3.2398 2.7453 4.6200 5.0667 6.7766 3.5417 2.5485 3.5506 4.6776 4.7730 3.2466 2.6449 1.2412 2.3012 4.0440 4.2859 3.9867 3.7096 1.8556 4.8293 1.6217 1.3559 1.8196 1.8621 3.0659 2.3790 1.5691 1.6475 1.5199 1.4127 1.5312 3.3565 2.1154 1.8353 1.7386 1.6884 3.8291 2.1082 1.3762 1.5526 2.5814 1.2640 1.2660 1.3479 1.3418 5.4093 1.2191 2.2674 1.6649 2.1726 1.3480 1.0469 1.1659 1.1038 1.0583 1.1756 1.1041 1.6032 6.3745 8.2192 6.4321 4.7431 1.0649 1.0358 1.0364 1.0659 1.0978 1.0965 1.0969 1.0976 1.0605 1.1017 1.1008 1.0949 1.0920 1.0930 1.1147 1.0775
irintensity: 0.2696 0.0777 2.0557 0.4757 1.1069 2.9511 1.1324 4.1866 0.8033 2.0721 4.1234 1.6501 1.2685 1.8035 2.8212 3.8573 2.3522 10.9965 0.7247 2.8511 1.7341 4.2370 2.7132 12.3593 5.6963 23.4103 9.8372 73.0278 14.1069 23.3088 2.5851 6.2287 5.7197 28.4994 57.6978 12.5971 16.2128 6.6108 9.8366 18.7177 103.2110 41.1439 22.8473 4.4304 11.4368 6.5167 5.3390 19.3826 2.8929 12.5380 0.9993 154.2425 95.5486 80.2346 75.2572 65.4155 104.4754 1.0786 19.7622 11.6583 0.9160 15.3600 12.4496 17.0648 124.9812 5.2442 14.7874 105.6122 11.7201 6.6312 57.2665 27.5751 181.2848 52.7882 34.2500 100.2818 2.2908 32.0204 27.9026 24.1114 47.5767 8.6657 13.8737 8.0350 37.3019 12.3103 33.0125 20.1612 9.7649 1.3992 2.5104 23.4891 19.4920
temp: 298.150 k
press: 1.00000 atm
elementType: 17 8 8 7 6 6 6 6 6 6 6 6 6 6 6 6 6 1 1 1 1 1 1 1 1 1 1 1 1 1 1 1 1
symmnumber: 1
zpe: 686911.6 jmol-1
zpe.correction: 0.261631 hartree
zpe.thermalcorrener: 0.279357 hartree
zpe.thermalcorrenthalpy: 0.280301 hartree
zpe.thermalcorrgfe: 0.214812 hartree
zpe.sumelectzpe: -1168.950692 hartree
zpe.sumelectthermal: -1168.932965 hartree
zpe.sumelectthermalent: -1168.932021 hartree
zpe.sumelectthermalfe: -1168.997510 hartree
dipole: -1.2864 1.3336 -3.2509
dipole: 3.7419
quadrupole: -111.5881 -91.4210 -111.9002
quadrupole: 1.3434 3.9560 -3.6214
quadrupole: -6.6183 13.5488 -6.9304 1.3434 3.9560 -3.6214
hfenergy: -1169.2123224 hartree
pointgroup: C01 [X(C13H16Cl1N1O2)]
dipole: -0.5246019 -0.2942954 1.3436633 debye
polarizability: 217.7534871|-19.4086547|204.4550206|-9.0649044|2.6023536|95.6030661 unknown
InChI: InChI=1S/C13H16ClNO2/c1-4-6-17-12-9(3)7-10(14)8-11(12)13(16)15-5-2/h4,7-8,15H,1,5-6H2,2-3H3
charge 0 multiplicity 1
33 atoms
Cl 4.112482 -1.852734 -0.554182
O  -0.446562 2.056687 -0.036005
O  -1.980417 -0.586769 -1.137476
N  -1.281154 -2.090098 0.501076
C  0.280176 -0.356234 -0.223893
C  0.512458 1.051754 -0.183732
C  1.843373 1.572874 -0.29581
C  1.399408 -1.233838 -0.323846
C  2.926907 0.678743 -0.408301
C  -1.08677 -0.992551 -0.327213
C  2.693361 -0.710358 -0.407887
C  2.066494 3.069699 -0.278268
C  -2.485112 -2.936627 0.432927
C  -1.795074 1.790225 0.534992
C  -2.184494 -4.356047 -0.09283
C  -2.281139 3.082053 1.133823
C  -3.481714 3.637539 0.836955
H  1.238582 -2.313742 -0.396974
H  3.946365 1.067499 -0.489496
H  3.139574 3.311484 -0.358076
H  1.528655 3.55854 -1.11051
H  1.6667 3.518964 0.648992
H  -0.543628 -2.336754 1.164216
H  -2.950216 -2.989343 1.436453
H  -3.187993 -2.415579 -0.239154
H  -2.459775 1.414972 -0.260476
H  -1.694915 1.005087 1.31478
H  -1.761915 -4.311203 -1.111645
H  -1.466726 -4.888657 0.558739
H  -3.114149 -4.95274 -0.129725
H  -1.610196 3.559526 1.861405
H  -3.823028 4.559077 1.321021
H  -4.15726 3.183853 0.10132
