program: Gaussian 09
title: 000005092
version: EM64L-G09RevD.01
frameworkgroup: C1[X(C16H21NO3)]
method: RPBEPBE
basis: SDD
operation: Freq
keyword: #p
keyword: freq=noraman
keyword: PBEPBE/SDD
title: #p freq=noraman PBEPBE/SDD
converged: YES YES NO NO
title: Mulliken charges:
elementType: O O O N C C C C C C C C C C C C C C C C H H H H H H H H H H H H H H H H H H H H H
charge: -0.295457 -0.283416 -0.244885 -0.357535 -0.046466 -0.484402 -0.459301 -0.425974 -0.433933 -0.228252 -0.382628 -0.554124 0.474694 0.295086 -0.517027 0.126232 -0.428304 0.124781 -0.352011 -0.526181 0.233642 0.208597 0.244148 0.255934 0.208464 0.218553 0.226163 0.226493 0.218572 0.256802 0.218312 0.233641 0.252183 0.248885 0.237408 0.317328 0.245818 0.251853 0.256713 0.230312 0.209283
chargesum: 0.00000
title: Mulliken charges with hydrogens summed into heavy atoms:
elementType: O O O N C C C C C C C C C C C C C C C C
charge: -0.295457 -0.283416 -0.244885 -0.040207 0.187175 -0.031656 0.005097 0.018741 0.011132 0.028551 0.069326 -0.053056 0.474694 0.295086 -0.279619 0.126232 -0.182487 0.124781 -0.100158 0.170127
polarizability: 2.53939699e+02 1.78812647e+00 1.90812250e+02 8.39583272e+00 5.12478145e+00 1.20649244e+02
1716.lowfreq: -0.0007 -0.0006 -0.0004 3.0778 8.0351 11.9773 30.7882 36.6679 46.0392
frequency: 30.0854 36.5480 45.7787 53.2105 59.1658 73.1478 84.3133 116.0676 118.8070 152.3429 169.4910 188.2768 206.8242 228.1086 236.9250 283.1657 313.8597 330.5433 372.4125 406.1819 467.2356 472.8194 484.6185 507.1462 532.4990 546.3950 594.9995 617.6120 627.6561 642.1902 662.5535 691.5469 732.9081 744.6677 765.1818 784.2219 809.3476 824.8483 835.5609 855.5340 868.4379 880.3364 889.2463 908.6986 912.5633 937.5624 943.4348 959.7279 967.5160 982.5851 1018.2092 1043.4836 1051.4276 1075.0352 1091.5815 1095.9783 1112.1367 1114.0564 1150.5965 1153.2419 1157.1361 1169.5575 1171.2983 1198.9642 1202.7122 1218.1411 1222.7510 1234.2854 1247.1657 1255.4013 1267.2805 1275.3994 1284.3420 1293.1334 1295.4364 1303.6213 1319.5399 1326.1751 1328.0741 1334.3939 1369.9979 1393.7655 1401.6840 1429.5769 1452.6666 1453.7046 1457.1343 1463.2771 1471.6031 1483.2879 1490.0200 1498.0785 1498.9694 1579.4951 1608.5043 1670.9001 2959.8730 2968.9005 2970.2796 2988.7000 2998.9581 3004.6199 3006.7644 3013.3265 3025.8130 3039.8441 3054.0101 3069.3861 3076.6763 3079.6628 3092.1484 3094.3537 3122.9258 3146.2763 3150.7777 3168.0603 3571.5600
redmass: 3.9183 1.8471 3.6538 4.2150 3.5499 3.4873 2.7551 3.0732 2.9348 3.7520 1.7262 2.5566 3.1099 4.7998 4.1032 3.3633 4.4397 4.2552 3.6339 3.1531 2.8238 2.7425 3.6345 3.4195 2.1097 3.8291 4.2454 2.8756 2.7523 3.0072 4.8058 2.8025 3.4497 3.8856 2.7709 1.7880 2.0198 1.7069 2.7863 1.7492 3.1361 3.5858 2.8833 1.4663 2.0676 2.4093 1.3700 6.3685 1.7150 2.8037 1.6074 2.1145 2.2043 2.5262 1.4957 3.1162 1.2384 2.6065 1.5076 1.4226 1.4004 1.5616 1.3514 1.2222 1.3070 1.4220 1.6307 2.1342 1.4281 2.5353 1.3728 1.4494 1.2165 1.2321 1.3523 1.9315 1.4224 1.7098 1.5378 1.4828 5.7406 1.9269 2.8218 1.2974 1.0814 1.0885 1.0608 1.0855 1.0787 1.0582 1.1195 1.3326 1.9179 7.5935 6.3103 8.4023 1.0783 1.0666 1.0352 1.0713 1.0675 1.0650 1.0623 1.0667 1.0705 1.1017 1.1018 1.0996 1.0974 1.1021 1.1040 1.0979 1.1038 1.0875 1.0893 1.0964 1.0787
irintensity: 3.3492 0.0548 0.8229 0.9375 0.5312 0.6783 7.2108 0.1136 2.3570 1.7575 0.9681 2.2734 1.9138 2.2605 3.0209 5.0354 2.7871 3.5176 1.5689 4.3785 1.0836 7.8421 8.4447 16.9875 33.6648 2.9493 24.3460 62.2464 21.9579 4.1078 18.8164 0.6152 0.4234 9.4763 4.6092 3.3224 8.3107 30.0652 15.3579 13.4238 21.0773 9.0038 12.0440 1.2072 6.9231 5.5861 2.8137 42.1182 11.1821 63.3760 8.1644 32.3776 12.3638 5.2237 4.7361 13.0542 10.3890 71.1031 8.2503 16.1105 9.6995 8.8957 14.9092 5.7337 12.3347 13.9576 44.1556 109.7407 7.7142 176.6480 18.4914 25.6675 8.4807 0.1475 0.4715 30.8751 5.7572 14.5190 15.8425 13.5368 9.7425 14.1057 31.1519 7.7757 13.3058 7.5730 10.5901 5.9155 13.8445 14.5265 40.6861 29.4117 131.4859 20.9854 23.9158 472.9099 7.7456 63.6054 84.0053 8.0557 7.8391 9.7657 38.3418 96.8194 26.5728 35.2686 8.1033 4.2874 30.0801 26.1676 86.8161 10.4547 21.8640 9.2490 15.6065 7.0053 24.0030
temp: 298.150 k
press: 1.00000 atm
elementType: 8 8 8 7 6 6 6 6 6 6 6 6 6 6 6 6 6 6 6 6 1 1 1 1 1 1 1 1 1 1 1 1 1 1 1 1 1 1 1 1 1
symmnumber: 1
zpe: 898940.1 jmol-1
zpe.correction: 0.342388 hartree
zpe.thermalcorrener: 0.361629 hartree
zpe.thermalcorrenthalpy: 0.362573 hartree
zpe.thermalcorrgfe: 0.292803 hartree
zpe.sumelectzpe: -901.205565 hartree
zpe.sumelectthermal: -901.186325 hartree
zpe.sumelectthermalent: -901.185381 hartree
zpe.sumelectthermalfe: -901.255150 hartree
dipole: -5.5255 -3.5302 0.8361
dipole: 6.6100
quadrupole: -152.6192 -109.0830 -120.0512
quadrupole: 2.6532 -5.2799 6.7728
quadrupole: -25.3681 18.1682 7.1999 2.6532 -5.2799 6.7728
hfenergy: -901.5479535 hartree
pointgroup: C01 [X(C16H21N1O3)]
dipole: -2.2223381 1.3294315 -0.2384254 debye
polarizability: 253.715038|0.7964811|190.1983917|-10.449644|7.9102112|121.4877638 unknown
InChI: InChI=1S/C16H21NO3/c1-19-14-7-6-11(12-9-16(18)17-10-12)8-15(14)20-13-4-2-3-5-13/h6-8,12-13,17H,2-5,9-10H2,1H3
charge 0 multiplicity 1
41 atoms
O  -2.292322 -0.139078 0.560055
O  -2.07348 -2.961047 0.403778
O  6.238592 0.716447 -0.105595
N  4.210563 1.806845 0.419231
C  -2.426918 1.338649 0.685614
C  -3.81107 1.585632 1.309675
C  -2.5218 2.005916 -0.705505
C  -4.823367 1.525548 0.124634
C  -3.97335 1.706385 -1.17969
C  2.617573 0.309155 -0.495504
C  2.765603 1.532878 0.473986
C  3.996938 -0.392437 -0.382337
C  1.384486 -0.553014 -0.239474
C  -1.04197 -0.686059 0.229539
C  0.135032 0.070672 0.020535
C  4.980783 0.73926 -0.030721
C  1.434679 -1.964884 -0.295957
C  -0.98021 -2.113458 0.146031
C  0.260825 -2.728409 -0.109928
C  -3.310359 -2.737205 -0.371997
H  -1.597676 1.716009 1.315143
H  -3.809373 2.58955 1.774217
H  -4.024119 0.848324 2.101727
H  -1.75789 1.636755 -1.410835
H  -2.366155 3.095836 -0.581746
H  -5.595777 2.308838 0.221969
H  -5.347753 0.554133 0.111996
H  -3.988034 0.776586 -1.775277
H  -4.362848 2.51391 -1.823973
H  2.54611 0.726684 -1.521689
H  2.179841 2.408145 0.139403
H  2.436104 1.261895 1.498012
H  4.320084 -0.904961 -1.301997
H  4.014806 -1.131024 0.442465
H  0.087788 1.163208 0.066519
H  4.643207 2.657262 0.781032
H  2.379175 -2.478541 -0.499253
H  0.282336 -3.821886 -0.153637
H  -3.734777 -1.741614 -0.162077
H  -3.998692 -3.529857 -0.040877
H  -3.109784 -2.844648 -1.456195
