program: Gaussian 09
title: 000042772
version: EM64L-G09RevD.01
frameworkgroup: C1[X(C13H10)]
method: RPBEPBE
basis: SDD
operation: Freq
keyword: #p
keyword: freq=noraman
keyword: PBEPBE/SDD
title: #p freq=noraman PBEPBE/SDD
converged: NO YES NO YES
title: Mulliken charges:
elementType: C C C C C C C C C C C C C H H H H H H H H H H
charge: -0.285043 0.247320 0.409403 0.341507 0.509958 -0.618753 -0.410232 -0.438748 -0.428217 -0.427796 -0.823311 -0.216597 -0.216499 0.255694 0.242098 0.247208 0.237935 0.237547 0.230089 0.235742 0.230089 0.220345 0.220259
chargesum: 0.00000
title: Mulliken charges with hydrogens summed into heavy atoms:
elementType: C C C C C C C C C C C C C
charge: -0.285043 0.247320 0.409403 0.341507 0.509958 -0.363059 -0.168135 -0.191540 -0.190282 -0.190249 -0.127390 0.003748 0.003760
polarizability: 1.85715424e+02 -1.04788166e+01 1.75040298e+02 -2.34844994e-03 -1.44159079e-03 5.80924138e+01
1716.lowfreq: -7.7847 -0.0009 -0.0006 0.0003 5.1463 6.1779 123.0945 141.7211 169.5586
frequency: 123.0922 141.7176 169.5574 215.6485 223.4655 296.6214 397.8787 403.9448 455.5757 486.2585 517.4337 533.6764 576.9859 585.0558 628.0823 662.2827 675.7095 768.0998 776.5142 780.7474 797.6019 822.8591 863.0363 916.8860 926.9370 951.0850 976.8304 984.9878 998.0175 1020.8090 1039.5574 1041.2415 1072.6003 1150.9444 1169.9248 1191.5647 1204.2098 1233.2350 1265.4714 1312.6690 1366.5034 1396.2732 1404.0058 1412.0050 1463.1407 1464.1002 1470.1498 1472.5870 1482.5683 1558.2455 1600.4523 1627.4988 1628.0628 2964.4314 3034.2860 3083.2231 3120.2924 3121.1740 3132.1684 3134.6396 3152.8952 3154.4265 3179.9934
redmass: 2.1445 1.3187 3.5395 3.6201 2.8353 3.4567 4.4614 3.7647 3.1719 6.2125 3.7721 5.6246 5.8557 3.0747 3.5453 5.7889 2.7064 1.3015 1.9235 4.3316 5.1908 1.5555 2.0359 1.4023 1.4688 4.0775 1.3572 1.3748 1.6798 2.7624 1.9131 1.5402 2.8590 1.6077 1.2361 1.3249 1.5795 1.7623 2.4187 3.1709 2.9230 1.3715 2.7680 1.8647 1.7279 1.0454 7.4419 1.7360 3.9282 5.1514 6.9649 7.8642 7.6141 1.0380 1.0967 1.0975 1.0859 1.0858 1.0920 1.0922 1.0985 1.0980 1.0962
irintensity: 4.1658 1.9145 4.3975 1.7461 0.5922 1.0091 1.2127 0.3516 0.0520 1.5545 0.5854 3.5258 0.4270 0.3754 6.2753 0.5429 1.6867 0.7431 74.8223 1.3558 0.0119 12.5547 75.1690 0.8712 1.6858 0.6254 0.0951 3.2418 7.7909 1.8648 6.8027 5.6180 5.4446 0.1412 1.4661 2.1996 1.5393 8.3553 1.4009 17.9074 1.5710 8.3783 0.3366 0.8479 7.7526 14.9994 40.0974 22.0796 27.0791 10.6926 0.3330 2.8301 1.8792 37.1816 21.8126 21.8988 0.5082 1.0347 14.5144 19.6869 59.8851 20.7927 12.6549
temp: 298.150 k
press: 1.00000 atm
elementType: 6 6 6 6 6 6 6 6 6 6 6 6 6 1 1 1 1 1 1 1 1 1 1
symmnumber: 1
zpe: 483183.3 jmol-1
zpe.correction: 0.184035 hartree
zpe.thermalcorrener: 0.193611 hartree
zpe.thermalcorrenthalpy: 0.194556 hartree
zpe.thermalcorrgfe: 0.149465 hartree
zpe.sumelectzpe: -500.512540 hartree
zpe.sumelectthermal: -500.502963 hartree
zpe.sumelectthermalent: -500.502019 hartree
zpe.sumelectthermalfe: -500.547110 hartree
dipole: -0.2413 0.3476 0.0000
dipole: 0.4232
quadrupole: -63.7812 -65.3287 -81.7015
quadrupole: -0.5628 -0.0003 -0.0001
quadrupole: 6.4893 4.9417 -11.4310 -0.5628 -0.0003 -0.0001
hfenergy: -500.6965748 hartree
pointgroup: C01 [X(C13H10)]
dipole: 0.1013959 -0.1320583 0.0000029 debye
dipolederiv: -0.2849142 -0.2838782 -0.0000086 -0.3882091 -0.0959358 -0.0000066 -0.0000091 -0.0000061 -0.0893748 -0.229578 0.1810723 0.0000029 -0.2635813 -0.0754867 -0.0000055 -0.0000071 0.0000044 0.0167942 0.0537205 -0.1806096 -0.000003 0.2686835 -0.1254203 0.000005 0.0000082 -0.0000063 0.0601677 0.4273119 0.0284491 0.0000078 0.2739939 0.2337611 0.0000101 0.0000156 0.0000078 -0.0633363 0.0100652 0.097181 -0.0000009 0.1195693 -0.0799097 -0.0000012 -0.0000015 -0.0000012 0.0890539 0.0070299 0.2232217 0.0000088 0.0525719 -0.0749821 0.0000004 0.0000057 -0.0000027 -0.2366907 0.2289046 -0.0536539 0.000008 0.1771528 -0.0078599 0.0000036 0.0000119 -0.0000031 -0.1443868 -0.0137414 0.2007546 0.0000069 -0.0071295 0.2167062 0.0000047 0.0000041 0.000008 -0.1615126 0.1878844 0.0371814 0.0000077 -0.1187881 0.1228762 0.0000021 0.0000035 0.000003 -0.1793151 0.0640092 -0.1028614 0.0000035 0.0483091 0.1757742 0.0000059 0.0000083 0.0000063 -0.1860872 -0.1648461 -0.010032 -0.0000041 0.0690639 0.046982 -0.0000008 -0.0000165 0. 0.0826484 -0.3158702 0.0182749 -0.0000022 -0.0295498 0.1648104 0.0000024 -0.000003 0.0000035 -0.1617823 0.1534668 -0.1387217 0.000001 -0.0952182 -0.2676566 -0.0000026 0.0000003 -0.0000035 -0.1607484 0.0378197 -0.05964 -0.0000029 -0.0926273 -0.0720316 -0.0000041 -0.0000023 0.0000004 0.1754277 -0.0909213 0.0807194 -0.0000043 0.0598358 0.0707075 0.0000008 -0.0000065 0.000003 0.1472701 0.0851473 0.0132256 -0.0000013 0.0329869 -0.1175931 -0.0000039 -0.000004 -0.0000007 0.1571593 -0.0275821 -0.1249864 -0.0000057 -0.0694429 -0.0083027 -0.0000037 -0.0000028 -0.000002 0.1574991 -0.0592417 -0.0591904 -0.0000046 -0.1174766 0.0227996 -0.0000038 -0.0000089 -0.0000041 0.1595709 -0.0213478 0.0173887 -0.0430045 0.0492275 0.047168 0.1070139 -0.1079795 0.079052 -0.0447893 0.0176502 -0.0375356 0. -0.1509039 -0.1149774 0.0000047 0.000006 0.0000046 0.1116411 -0.0213423 0.017391 0.0430004 0.0492336 0.0471558 -0.1070192 0.1079783 -0.0790575 -0.0447713 0.0763585 0.0432814 -0.0000016 0.0359016 -0.1510078 -0.0000022 -0.0000009 -0.0000034 0.1576361 -0.119983 0.092968 -0.0000034 0.0963969 0.0424229 0. 0. -0.0000025 0.1579265 unknown
polarizability: 186.6949256|-9.9191668|174.0607962|0.0022766|0.0015526|58.0924138 unknown
InChI: InChI=1S/C13H10/c1-9-8-11-6-2-4-10-5-3-7-12(9)13(10)11/h2-8H,1H3
charge 0 multiplicity 1
23 atoms
C  -0.195159 0.010996 0.000054
C  1.16881 -0.418415 0.000071
C  -0.257898 1.441637 0.000073
C  2.004226 0.818971 0.000112
C  -1.313866 -0.84921 0.000019
C  1.146484 1.913972 0.000114
C  1.425011 -1.795102 0.00006
C  -1.523674 2.039866 0.00007
C  -1.026441 -2.260566 0.000001
C  -2.606331 -0.210327 0.000016
C  3.509194 0.829486 0.00013
C  0.307208 -2.703684 0.000033
C  -2.689574 1.191456 0.000025
H  1.458148 2.961054 0.000128
H  2.445356 -2.196516 0.00008
H  -1.650446 3.128639 0.000086
H  -1.845762 -2.989567 -0.000025
H  -3.521029 -0.815151 -0.000007
H  3.915192 0.308147 0.889252
H  3.907343 1.858211 0.000104
H  3.915218 0.308088 -0.888941
H  0.509333 -3.781206 0.00003
H  -3.678443 1.66492 0.000015
