program: Gaussian 09
title: 000042812
version: EM64L-G09RevD.01
frameworkgroup: C1[X(C12H10N2O4S2)]
method: RPBEPBE
basis: SDD
operation: Freq
keyword: #p
keyword: freq=noraman
keyword: PBEPBE/SDD
title: #p freq=noraman PBEPBE/SDD
converged: YES YES NO NO
title: Mulliken charges:
elementType: S S O O O O N N C C C C C C C C C C C C H H H H H H H H H H
charge: 0.245044 0.291206 -0.248210 -0.239912 -0.162836 -0.182468 0.100885 0.092418 0.061877 0.052662 -0.322617 -0.321253 -0.212817 -0.319070 -0.211010 -0.213581 0.065551 0.047245 -0.507402 -0.505340 0.268551 0.267786 0.239208 0.239584 0.248306 0.241407 0.246844 0.247912 0.247787 0.242243
chargesum: 0.00000
title: Mulliken charges with hydrogens summed into heavy atoms:
elementType: S S O O O O N N C C C C C C C C C C C C
charge: 0.245044 0.291206 -0.248210 -0.239912 -0.162836 -0.182468 0.100885 0.092418 0.061877 0.052662 -0.054066 -0.053467 -0.212817 -0.319070 0.028198 0.026003 0.065551 0.047245 0.229155 0.232603
polarizability: 3.09558276e+02 3.32475903e+00 2.02776051e+02 -1.94027481e+01 1.18438591e+01 1.20508208e+02
1716.lowfreq: -4.1664 0.0017 0.0018 0.0026 5.1694 5.7182 12.7285 31.7247 38.2980
frequency: 12.7000 31.6934 38.2672 48.6064 52.3971 67.6097 85.3631 97.2141 98.5984 134.3071 134.7902 141.6777 168.9468 191.7578 217.6196 238.4735 266.6334 298.8369 305.5155 318.9314 403.2959 405.1746 419.8993 442.1823 468.0359 496.4538 525.1211 546.1654 570.4068 586.3793 602.1147 604.7120 622.5409 708.7598 740.4123 743.6882 762.7685 779.8527 794.6990 860.9860 888.1654 890.2202 893.5906 943.3654 975.1737 1002.0937 1009.7687 1056.6457 1073.6000 1109.3235 1109.5548 1111.2978 1135.2703 1144.9312 1145.0942 1180.3224 1209.6012 1279.1349 1281.8963 1316.1441 1397.1836 1418.1534 1419.0074 1439.6571 1453.0871 1453.4599 1462.5551 1463.3909 1467.1238 1492.3221 1545.9261 1613.9293 1642.7487 1662.1670 3008.0556 3009.3127 3113.4163 3115.4982 3140.2560 3155.0543 3158.1364 3159.0454 3171.0320 3179.1894
redmass: 5.6590 6.0655 5.2745 6.5332 5.3543 4.0222 1.3037 1.7472 2.3032 3.5666 6.4439 3.3831 12.0159 6.2885 5.3311 6.2032 7.0921 6.0173 6.0520 6.3107 9.7761 10.9283 7.9104 13.3673 8.6180 3.9462 10.3330 4.0454 8.3490 8.2626 11.7000 11.7214 13.2904 7.1301 6.3283 6.3463 6.1916 1.2917 4.0735 7.0901 8.6630 1.6042 8.6904 9.8618 1.3609 1.3314 2.0961 10.7519 10.0954 1.2588 1.2540 1.8009 2.5470 1.4008 1.4084 1.6075 2.3906 2.8713 2.5303 5.9546 5.2289 1.1675 1.1599 2.9162 1.0508 1.0506 1.0517 1.0530 3.6930 8.6199 6.5977 6.5005 10.5968 10.9810 1.0293 1.0292 1.1054 1.1055 1.0865 1.0902 1.1049 1.1050 1.0958 1.1001
irintensity: 0.0968 2.7199 0.3351 0.9644 1.4416 1.1955 0.6725 0.8771 0.4465 3.0494 0.4829 8.2848 1.7000 5.2607 15.0385 1.5068 0.2923 7.4451 15.2999 12.2709 18.4293 7.5090 3.6312 1.5597 11.3066 2.8341 9.8029 1.5337 3.8596 19.7459 8.0664 8.1200 1.9318 0.4261 32.9048 30.7287 0.3331 96.7579 0.2641 18.4205 42.9070 0.2319 20.9271 130.5392 2.4709 0.0248 9.8540 650.7492 906.0378 0.5155 0.1362 6.1056 22.8423 8.8423 18.5967 17.2853 4.1677 21.4421 10.8752 4.5946 0.8471 12.9218 22.7830 0.4540 18.3939 13.2327 15.8221 18.3577 8.6555 26.3198 26.1371 2.8949 133.7868 162.1509 35.1413 36.2337 22.5867 20.8663 2.9837 8.5242 12.8887 13.4877 8.1973 23.4572
temp: 298.150 k
press: 1.00000 atm
elementType: 16 16 8 8 8 8 7 7 6 6 6 6 6 6 6 6 6 6 6 6 1 1 1 1 1 1 1 1 1 1
symmnumber: 1
zpe: 531910.5 jmol-1
zpe.correction: 0.202594 hartree
zpe.thermalcorrener: 0.222834 hartree
zpe.thermalcorrenthalpy: 0.223778 hartree
zpe.thermalcorrgfe: 0.149926 hartree
zpe.sumelectzpe: -1668.331607 hartree
zpe.sumelectthermal: -1668.311368 hartree
zpe.sumelectthermalent: -1668.310424 hartree
zpe.sumelectthermalfe: -1668.384276 hartree
dipole: 0.1755 1.4492 1.7854
dipole: 2.3062
quadrupole: -89.9797 -115.4768 -134.4951
quadrupole: 1.5336 5.8263 -2.8749
quadrupole: 23.3375 -2.1596 -21.1779 1.5336 5.8263 -2.8749
hfenergy: -1668.5342014 hartree
pointgroup: C01 [X(C12H10N2O4S2)]
dipole: 0.1278929 -0.4349 -0.7859867 debye
polarizability: 308.840669|2.4884687|196.1410923|21.2299615|26.5160782|127.8607738 unknown
InChI: InChI=1S/C12H10N2O4S2/c1-17-11(15)19-9-10(20-12(16)18-2)14-8-6-4-3-5-7(8)13-9/h3-6H,1-2H3
charge 0 multiplicity 1
30 atoms
S  1.717507 -0.882732 1.070419
S  1.034592 2.340945 1.548743
O  3.118937 -2.756509 -0.056577
O  3.189743 3.271597 0.401646
O  1.307242 -2.140744 -1.410524
O  1.947013 1.912624 -1.050531
N  -0.89265 -1.073798 0.240021
N  -1.435279 1.700988 0.585865
C  -2.147639 -0.565088 -0.0584
C  -2.426971 0.845208 0.119862
C  -3.176692 -1.434355 -0.527301
C  -3.724401 1.355558 -0.179097
C  0.048745 -0.223669 0.651298
C  -0.232584 1.186691 0.839398
C  -4.441127 -0.910804 -0.816195
C  -4.715806 0.484505 -0.642813
C  1.970657 -2.04056 -0.370934
C  2.129263 2.4528 0.052632
C  3.576865 -3.709111 -1.10556
C  4.18864 3.511208 -0.676612
H  -2.941301 -2.494811 -0.655332
H  -3.907489 2.424809 -0.037969
H  -5.234326 -1.571678 -1.181655
H  -5.714285 0.868454 -0.877064
H  2.79464 -4.461816 -1.298611
H  4.477592 -4.170896 -0.679491
H  3.807611 -3.165269 -2.036706
H  3.701775 3.986871 -1.54399
H  4.64737 2.556734 -0.983246
H  4.928858 4.180148 -0.217775
