program: Gaussian 09
title: 000005081
version: EM64L-G09RevD.01
frameworkgroup: C1[X(C15H14N6O3)]
method: RPBEPBE
basis: SDD
operation: Freq
keyword: #p
keyword: freq=noraman
keyword: PBEPBE/SDD
title: #p freq=noraman PBEPBE/SDD
converged: YES YES NO NO
title: Mulliken charges:
elementType: O O O N N N N N N C C C C C C C C C C C C C C C H H H H H H H H H H H H H H
charge: -0.281017 -0.234963 -0.285342 -0.270217 -0.114463 -0.025200 -0.069167 -0.000014 -0.042322 0.361967 -0.570670 0.337324 0.148773 -0.185050 0.153593 -0.259706 -0.337190 -0.461910 -0.625176 0.279803 -0.378708 0.200322 -0.222977 -0.668829 0.299758 0.266506 0.277168 0.260004 0.292378 0.234169 0.248539 0.276719 0.264128 0.227870 0.227692 0.207929 0.234862 0.233415
chargesum: 0.00000
title: Mulliken charges with hydrogens summed into heavy atoms:
elementType: O O O N N N N N N C C C C C C C C C C C C C C C
charge: -0.281017 -0.234963 -0.285342 -0.270217 -0.114463 -0.025200 -0.069167 -0.000014 -0.042322 0.361967 -0.004405 0.337324 0.148773 -0.185050 0.153593 0.017462 -0.077185 -0.169532 0.134251 0.279803 -0.114580 0.200322 0.232586 0.007377
polarizability: 3.91959089e+02 -1.25603617e+01 2.11633764e+02 6.82291101e-01 -5.58038152e+00 1.15410949e+02
1716.lowfreq: -6.8320 -0.8352 -0.0005 0.0006 0.0008 3.3848 21.7623 33.0341 46.1864
frequency: 21.7457 33.0297 46.1833 63.9914 68.6517 79.1869 84.9057 96.5083 110.5336 123.3987 135.4115 152.2647 182.7554 188.3108 222.6309 238.5035 262.6031 271.3230 285.7127 305.3680 352.0419 357.4333 385.7407 392.9260 398.8700 411.7928 420.5001 460.7710 462.1075 508.4200 524.4237 564.6008 596.0876 632.0469 650.8625 656.9403 663.7261 693.1345 721.2565 731.8456 760.3595 768.9366 789.2458 797.9352 801.1704 825.9802 833.4947 840.4912 910.2252 914.5048 942.1898 967.9758 968.5110 1015.2803 1040.8981 1069.1679 1089.7613 1112.1703 1113.8496 1122.3565 1134.4772 1143.3319 1156.0641 1180.4990 1212.8456 1242.2369 1247.4752 1248.9964 1276.7649 1281.0799 1320.1463 1327.1184 1331.5929 1361.1553 1377.0892 1385.7893 1395.1260 1402.3777 1415.2802 1422.5219 1449.0974 1462.2566 1468.5491 1472.1468 1477.4709 1485.9410 1487.7290 1489.8926 1550.9876 1567.5014 1576.0724 1593.3421 1613.0139 2052.8562 2983.9325 2986.5580 2997.3180 3007.1808 3066.2208 3067.3890 3094.2883 3105.8662 3110.1383 3125.9930 3148.8603 3154.7743 3179.8405 3241.9218
redmass: 4.7838 4.9472 4.4020 7.6069 4.2069 4.9848 5.4888 5.2824 3.7075 1.1557 3.3189 4.2837 6.3515 6.1073 5.8779 1.7785 2.4053 5.9597 3.6440 6.0000 4.5154 4.1229 5.3427 5.6391 5.6135 5.3179 3.6587 5.3920 13.1169 5.4934 5.3426 5.7250 4.0417 9.3236 5.8615 5.0610 7.1377 5.4075 6.9802 7.7149 4.4074 4.0256 2.4093 1.1833 2.5585 6.1450 4.6104 1.4684 3.1130 1.7184 4.0569 1.6124 2.0985 2.3931 4.0046 2.0780 2.8268 2.9848 2.3516 1.3462 1.4636 2.6509 1.9430 3.8535 2.2993 1.9958 2.6109 1.1353 2.4896 1.4688 2.3695 2.6845 2.0724 2.7944 3.9841 4.1000 2.2896 1.3290 3.9066 1.3797 4.0131 1.0397 1.1089 1.0663 1.1637 1.1068 2.2240 1.2459 9.1210 6.4659 8.2392 10.1926 6.6515 13.9772 1.0396 1.0636 1.0362 1.0577 1.1068 1.1016 1.0986 1.0953 1.1022 1.0993 1.0919 1.0892 1.0972 1.0987
irintensity: 0.1419 0.5454 0.4140 0.3470 2.7553 3.7627 0.2695 1.6433 3.7184 0.1252 0.8161 4.8329 2.0416 2.8503 1.9391 1.1239 4.4854 4.0135 0.2321 5.1770 11.3996 16.3652 4.0595 6.2618 2.2298 8.4901 2.2745 2.3839 1.7775 7.6492 9.6766 19.3351 7.5400 2.4126 25.2949 4.7547 2.5091 1.6205 8.4491 5.4220 5.7068 6.6649 13.2262 1.2894 14.5812 5.9079 1.7547 38.4211 37.3731 29.3561 37.7416 2.8216 5.8579 4.8223 212.0032 15.1442 127.1072 48.2670 17.0162 5.5367 5.6618 177.6251 36.2605 49.4810 93.7869 209.9546 2.6063 0.0106 81.6394 22.7682 2.6894 61.2210 180.1576 2.1171 58.3984 44.5736 5.3194 11.3849 3.9729 64.8262 140.7242 11.8441 29.0840 4.1688 14.4130 32.8027 201.9743 16.3940 107.7720 283.7789 26.8470 214.6455 8.9854 662.8722 37.8494 22.8681 24.1937 22.7767 10.8035 21.5638 30.8714 5.2633 39.4946 1.1776 5.0568 5.6129 2.3837 0.4734
temp: 298.150 k
press: 1.00000 atm
elementType: 8 8 8 7 7 7 7 7 7 6 6 6 6 6 6 6 6 6 6 6 6 6 6 6 1 1 1 1 1 1 1 1 1 1 1 1 1 1
symmnumber: 1
zpe: 736434.0 jmol-1
zpe.correction: 0.280493 hartree
zpe.thermalcorrener: 0.302246 hartree
zpe.thermalcorrenthalpy: 0.303190 hartree
zpe.thermalcorrgfe: 0.228075 hartree
zpe.sumelectzpe: -1132.425843 hartree
zpe.sumelectthermal: -1132.404090 hartree
zpe.sumelectthermalent: -1132.403146 hartree
zpe.sumelectthermalfe: -1132.478261 hartree
dipole: 1.5740 -1.7246 -2.1696
dipole: 3.1873
quadrupole: -143.0169 -136.3450 -141.2413
quadrupole: 15.4523 3.0827 -2.3225
quadrupole: -2.8158 3.8561 -1.0402 15.4523 3.0827 -2.3225
hfenergy: -1132.706336 hartree
pointgroup: C01 [X(C15H14N6O3)]
dipole: 0.5724382 0.7707893 0.8066343 debye
polarizability: 390.6230491|19.8690921|211.3141973|4.5769894|-13.0978642|117.066555 unknown
InChI: InChI=1S/C15H14N6O3/c1-3-24-15(23)13-12-7-20(2)14(22)10-6-9(18-19-16)4-5-11(10)21(12)8-17-13/h4-6,8H,3,7H2,1-2H3
charge 0 multiplicity 1
38 atoms
O  -1.77092 -2.646483 -1.053927
O  4.921974 0.691331 -0.019176
O  3.900144 -1.094275 1.07951
N  0.35307 0.949093 -0.277394
N  0.088494 -2.062383 0.221792
N  2.416851 1.731291 -0.823938
N  -5.322703 0.874539 0.065325
N  -6.034309 -0.174592 0.074532
N  -6.869573 -1.014816 0.097349
C  1.272335 0.083917 0.328239
C  0.781209 -1.094844 1.109617
C  -1.072484 0.852464 -0.169472
C  -1.750521 -0.40437 -0.165496
C  2.541157 0.581173 -0.014476
C  -1.131483 -1.781173 -0.371531
C  1.101185 1.928566 -0.961474
C  -1.815601 2.059403 -0.089719
C  -3.164865 -0.405905 -0.09831
C  0.74644 -3.359574 -0.0293
C  -3.897272 0.799831 -0.015224
C  -3.214363 2.042648 -0.013389
C  3.816871 -0.026808 0.404093
C  6.251759 0.122725 0.362968
C  7.305101 1.071091 -0.19882
H  1.648644 -1.593994 1.565888
H  0.094726 -0.770757 1.916474
H  0.638184 2.707403 -1.561628
H  -1.283611 3.015284 -0.065221
H  -3.668632 -1.37706 -0.154758
H  0.79513 -3.958788 0.898838
H  1.773557 -3.197585 -0.402143
H  0.154576 -3.906112 -0.778627
H  -3.789846 2.969792 0.055415
H  6.292825 0.043019 1.464591
H  6.327962 -0.896489 -0.057961
H  8.315299 0.6976 0.04995
H  7.22019 1.146467 -1.296072
H  7.191199 2.08227 0.227175
