program: Gaussian 09
title: 000042723
version: EM64L-G09RevD.01
frameworkgroup: C1[X(C18H17N2O)]
method: RPBEPBE
basis: SDD
operation: Freq
keyword: #p
keyword: freq=noraman
keyword: PBEPBE/SDD
title: #p freq=noraman PBEPBE/SDD
converged: YES YES NO NO
title: Mulliken charges:
elementType: O N N C C C C C C C C C C C C C C C C C C H H H H H H H H H H H H H H H H H
charge: -0.418218 -0.453805 -0.068481 0.062013 -0.018406 0.121403 0.200545 0.258912 0.200121 0.363116 0.200489 -0.382296 -0.826980 -0.299543 -0.814438 -0.452243 -0.338391 -0.228454 0.257922 -0.350934 -0.591422 0.326433 0.274411 0.225539 0.265109 0.265084 0.272025 0.225276 0.257044 0.257519 0.271458 0.253843 0.278817 0.241733 0.244232 0.274295 0.274214 0.372056
chargesum: 1.00000
title: Mulliken charges with hydrogens summed into heavy atoms:
elementType: O N N C C C C C C C C C C C C C C C C C C
charge: -0.046162 -0.127372 -0.068481 0.062013 -0.018406 0.121403 0.200545 0.258912 0.200121 0.363116 0.200489 -0.107886 -0.071247 -0.027518 -0.074599 -0.180784 -0.084548 0.050363 0.257922 -0.109201 0.201319
polarizability: 4.53594417e+02 8.76176382e+00 2.26778758e+02 -2.38214624e-02 -2.20153386e-03 9.19083490e+01
1716.lowfreq: -6.9055 -3.7515 -0.0006 0.0004 0.0005 5.7177 24.2070 43.0875 63.5160
frequency: 24.1724 42.8598 63.5060 73.5437 93.8354 113.8847 127.6529 159.5067 170.5945 205.4454 231.3089 244.7853 278.7268 308.0140 321.5810 340.2909 353.4537 361.5205 375.0332 406.6379 432.0616 436.5269 457.3628 463.9942 464.7299 525.5326 554.2345 569.5537 582.4063 600.7732 619.3835 623.1804 658.7300 682.1704 718.3815 731.3881 755.7686 779.9766 801.1764 807.8932 815.1086 823.7651 883.0020 886.1529 906.5042 916.2834 930.1658 959.4234 976.5443 1028.5265 1032.8429 1035.7541 1053.9565 1066.7247 1099.7606 1120.7189 1121.5157 1126.2411 1145.1602 1171.1089 1176.0444 1214.9141 1221.5360 1254.1682 1271.5652 1306.2382 1331.1235 1342.6210 1361.8460 1386.2514 1407.6826 1413.2493 1414.5756 1421.6419 1440.4058 1446.6942 1461.0801 1466.1276 1468.5947 1471.8397 1479.9639 1484.1884 1488.2225 1500.5827 1509.7594 1518.8270 1585.5551 1594.9422 1597.3093 1637.3014 1646.3071 2987.7305 2990.7296 3014.6058 3063.6804 3064.4465 3093.0693 3113.5059 3114.7245 3136.4023 3138.7896 3163.0402 3181.0036 3197.7838 3201.3749 3206.0544 3590.0271 3599.6406
redmass: 1.4421 1.8625 3.8314 1.0483 2.1856 2.8001 5.2321 1.8286 2.9744 3.4512 3.4669 3.7527 4.2982 3.4290 4.1174 4.4836 3.7725 1.1960 3.6286 4.1269 4.0548 3.4364 5.9617 3.1640 4.7962 5.2218 2.8482 1.2680 5.7286 3.9794 4.2212 3.7992 4.9603 6.4213 5.5342 5.2203 3.9821 4.8091 2.0116 1.5123 5.0427 2.1776 2.8726 1.5663 1.5656 3.4307 1.3501 1.3131 3.0641 2.9066 1.5017 1.5703 1.8267 2.3208 2.0215 1.7948 1.3384 2.7069 1.3487 1.7909 2.8920 1.6105 1.9371 1.5659 3.1916 1.7709 3.2487 3.3114 2.4690 2.4620 1.7437 1.3301 1.7250 2.2441 1.8773 2.8602 2.6601 1.0428 1.0405 1.0429 1.2648 1.5533 1.2823 3.3358 4.0954 2.0948 6.7086 6.8898 5.9158 5.9407 7.2850 1.0391 1.0410 1.0339 1.0975 1.0985 1.0965 1.1038 1.0948 1.0893 1.1028 1.0968 1.0888 1.0920 1.0923 1.0998 1.0665 1.0800
irintensity: 2.5875 0.2404 1.3000 0.1523 1.7746 2.1717 2.3166 3.6213 0.6287 3.9918 0.2436 0.4427 0.3715 0.7137 5.0856 3.0958 21.9020 124.2897 6.7985 2.4836 8.4488 1.0957 3.7131 10.8331 1.1262 3.2948 12.2785 88.3050 0.3257 18.5874 5.8742 0.3057 5.6563 0.9168 0.3906 8.2801 0.0253 0.9987 11.0566 67.2825 30.9292 28.5806 9.2862 13.4915 12.2204 5.0652 1.8040 0.1009 16.9034 10.2385 2.7431 1.6459 0.8770 18.6474 0.9076 133.4274 1.4383 8.1413 127.4071 31.5045 118.9156 27.2879 46.2923 5.8008 12.3569 47.0677 54.6953 128.2177 37.7241 19.4985 3.2298 24.2635 5.8177 33.2526 58.2688 72.0183 13.9945 3.0624 34.6354 17.4213 18.2266 44.6487 79.8898 176.5146 7.6026 24.7581 30.3278 62.2189 225.1160 12.9945 7.9186 16.1177 5.2535 23.6050 4.7992 7.7176 12.3269 4.7335 18.4312 9.2159 3.4990 5.1612 2.6373 0.7665 2.0663 0.1394 120.8096 92.8053
temp: 298.150 k
press: 1.00000 atm
elementType: 8 7 7 6 6 6 6 6 6 6 6 6 6 6 6 6 6 6 6 6 6 1 1 1 1 1 1 1 1 1 1 1 1 1 1 1 1 1
symmnumber: 1
zpe: 806514.0 jmol-1
zpe.correction: 0.307185 hartree
zpe.thermalcorrener: 0.325566 hartree
zpe.thermalcorrenthalpy: 0.326511 hartree
zpe.thermalcorrgfe: 0.260492 hartree
zpe.sumelectzpe: -879.210787 hartree
zpe.sumelectthermal: -879.192406 hartree
zpe.sumelectthermalent: -879.191462 hartree
zpe.sumelectthermalfe: -879.257480 hartree
dipole: -6.5728 0.9106 0.0049
dipole: 6.6356
quadrupole: -18.4933 -86.3433 -126.2141
quadrupole: 17.4219 -0.0190 0.0046
quadrupole: 58.5236 -9.3264 -49.1972 17.4219 -0.0190 0.0046
hfenergy: -879.5179724 hartree
pointgroup: C01 [X(C18H17N2O1)]
dipole: 2.5852708 0.3630068 -0.0100843 debye
polarizability: 453.6257118|-8.3424422|226.7255313|-0.4191504|-1.6895746|91.930281 unknown
InChI: InChI=1S/C18H17N2O/c1-10-15-9-20(3)7-6-13(15)11(2)18-17(10)14-8-12(21)4-5-16(14)19-18/h4-9,19,21H,1-3H3
charge 1 multiplicity 1
38 atoms
O  -5.119704 -2.184121 0.031866
N  -1.426484 1.997628 -0.023349
N  4.249715 -1.026844 0.005547
C  -0.534174 -0.125676 0.002402
C  -0.228449 1.305101 -0.016193
C  0.491811 -1.082107 0.014279
C  1.081204 1.827707 -0.024405
C  1.850251 -0.578487 0.005048
C  -1.995536 -0.243148 0.005388
C  2.129185 0.868685 -0.014294
C  -2.515337 1.094673 -0.010633
C  2.955536 -1.459347 0.01396
C  0.145359 -2.556365 0.035995
C  3.513202 1.26538 -0.022609
C  1.355298 3.319486 -0.043622
C  -2.895645 -1.332112 0.019326
C  -3.892744 1.367798 -0.012454
C  4.537346 0.341007 -0.012874
C  -4.283539 -1.062899 0.017569
C  -4.780401 0.270882 0.002007
C  5.383954 -1.991513 0.015475
H  -1.520673 3.011492 -0.036072
H  2.823224 -2.541245 0.027869
H  1.015187 -3.228936 0.052674
H  -0.466154 -2.796098 0.925191
H  -0.455686 -2.825636 -0.85199
H  3.78007 2.324075 -0.037349
H  0.429398 3.917064 -0.041662
H  1.938682 3.638795 0.839462
H  1.922727 3.618731 -0.94405
H  -2.577141 -2.375314 0.030945
H  -4.280579 2.39077 -0.02465
H  5.593561 0.614304 -0.01892
H  -5.861859 0.452212 0.001009
H  4.997262 -3.020777 0.032089
H  5.998721 -1.854238 -0.889116
H  6.005214 -1.827748 0.911162
H  -6.077504 -1.937078 0.02998
