program: Gaussian 09
title: 000042669
version: EM64L-G09RevD.01
frameworkgroup: C1[X(C12H2Cl6O2)]
method: RPBEPBE
basis: SDD
operation: Freq
keyword: #p
keyword: freq=noraman
keyword: PBEPBE/SDD
title: #p freq=noraman PBEPBE/SDD
converged: NO NO NO YES
title: Mulliken charges:
elementType: Cl Cl Cl Cl Cl Cl O O C C C C C C C C C C C C H H
charge: 0.069936 0.062479 0.064360 0.064204 0.015490 -0.021523 -0.236172 -0.256096 0.485691 0.454144 0.400632 0.322143 -0.385865 -0.371837 -0.311857 -0.368480 -0.117046 -0.121438 -0.236764 -0.095120 0.295882 0.287235
chargesum: 0.00000
title: Mulliken charges with hydrogens summed into heavy atoms:
elementType: Cl Cl Cl Cl Cl Cl O O C C C C C C C C C C C C
charge: 0.069936 0.062479 0.064360 0.064204 0.015490 -0.021523 -0.236172 -0.256096 0.485691 0.454144 0.400632 0.322143 -0.385865 -0.371837 -0.311857 -0.072599 -0.117046 -0.121438 0.050471 -0.095120
polarizability: 3.18893865e+02 -8.95578717e+00 2.39919471e+02 -4.32406355e-03 6.28035416e-03 6.64590320e+01
1716.lowfreq: -5.1738 0.0018 0.0021 0.0026 5.4726 6.5252 24.8655 37.7631 72.0131
frequency: 24.8515 37.7589 72.0131 80.4824 87.8579 135.1707 146.1262 157.8535 172.2620 178.2492 194.7735 200.8446 208.1126 226.8777 267.5807 318.6959 320.2082 333.4571 335.2854 347.3618 377.1796 384.4520 416.8227 514.1739 518.7492 543.8089 546.0204 582.8139 583.9064 597.8538 625.0861 670.7548 670.8829 753.7888 757.9968 787.7356 819.7562 846.1742 860.1597 883.1913 927.4790 944.6045 1068.2706 1122.0651 1132.5611 1200.7826 1223.0477 1268.3380 1345.0500 1352.8843 1369.6168 1395.3377 1406.9648 1447.8445 1550.3648 1560.2775 1589.9427 1615.0078 3188.1172 3189.8968
redmass: 20.7138 22.4588 24.0515 33.2542 25.4017 11.7594 32.8878 10.1322 13.3316 23.8365 22.9359 27.5406 34.7957 5.9613 20.5595 10.8368 29.4880 25.9912 9.8359 12.4583 11.7670 17.4300 9.7179 5.0824 12.3753 14.1133 5.3844 7.9468 10.9089 12.0940 11.4589 5.3276 12.7956 11.8784 11.8468 11.6422 8.9189 1.3949 1.3841 11.3592 12.2583 11.9037 2.1798 10.3050 4.1991 1.5191 5.2018 6.2978 11.7476 9.0572 9.7161 6.4548 8.3167 4.0674 11.4026 10.4867 9.9190 10.0033 1.0931 1.0939
irintensity: 0.0457 0.0013 0.0099 0.0066 0.0557 0.5093 0.0966 0.0387 0.0532 0.0449 0.0863 0.1431 0.0054 0.0644 0.2857 0.0303 0.0260 0.0151 0.0909 2.1483 6.1884 1.6595 6.6028 0.5155 3.5167 2.6354 5.8156 2.0255 0.7688 2.4157 23.5957 8.1983 3.1209 19.4705 0.1095 120.3157 19.5847 31.4191 20.3009 27.4847 121.5979 160.9509 1.3500 15.3902 46.0441 1.5828 43.4668 34.7915 118.7469 71.3366 31.5697 482.9999 262.1876 373.0862 36.1167 16.3506 59.4726 38.2181 3.2262 3.4863
temp: 298.150 k
press: 1.00000 atm
elementType: 17 17 17 17 17 17 8 8 6 6 6 6 6 6 6 6 6 6 6 6 1 1
symmnumber: 1
zpe: 278045.5 jmol-1
zpe.correction: 0.105902 hartree
zpe.thermalcorrener: 0.123985 hartree
zpe.thermalcorrenthalpy: 0.124929 hartree
zpe.thermalcorrgfe: 0.057539 hartree
zpe.sumelectzpe: -3367.848385 hartree
zpe.sumelectthermal: -3367.830303 hartree
zpe.sumelectthermalent: -3367.829358 hartree
zpe.sumelectthermalfe: -3367.896748 hartree
dipole: 1.2566 -0.5483 -0.0001
dipole: 1.3711
quadrupole: -155.3394 -157.3685 -154.9820
quadrupole: 0.6883 -0.0002 -0.0001
quadrupole: 0.5572 -1.4719 0.9146 0.6883 -0.0002 -0.0001
hfenergy: -3367.9542873 hartree
pointgroup: C01 [X(C12H2Cl6O2)]
dipole: 0.494953 0.2144475 0.0000225 debye
dipolederiv: 0.0076981 0.0240525 0.0000006 -0.0356745 -0.5926285 -0.0000018 -0.000006 -0.0000217 0.0246474 0.0014034 -0.0290119 -0.0000012 0.0376624 -0.613251 -0.0000268 0.000011 -0.0000555 0.0202188 -0.5522598 -0.2760858 -0.0000293 -0.3253865 -0.1552777 -0.0000162 -0.0000513 -0.0000158 0.0178734 -0.5528328 0.284789 0.0000211 0.3277303 -0.1606968 -0.0000116 0.0000255 -0.0000124 0.0179281 -0.0726222 0.0213442 -0.0000022 0.0884078 -0.6440148 -0.0000429 0.0000032 -0.0000448 -0.0115609 -0.7287647 -0.2988191 -0.0000566 -0.355618 -0.2854524 -0.0000313 -0.0000804 -0.0000312 -0.0435658 -2.150603 0.047914 -0.0000014 0.0424944 -0.2424576 -0.0000079 0.0000321 -0.0000246 -0.1113751 -2.1400428 0.0075174 -0.000002 -0.0157408 -0.3347908 0.0000125 0.0000044 0.0000267 -0.131827 1.2970496 -0.1478529 -0.0000387 -0.9836192 -0.0523596 0.0000082 -0.0001047 -0.0000003 0.1204448 1.2435288 0.094532 -0.0000213 0.96431 -0.0877011 -0.000033 -0.0000145 -0.0000325 0.1175149 1.1614873 0.1209752 0.0000207 1.0242454 -0.2471482 -0.0000126 0.000051 -0.0000129 0.0853584 1.3680926 -0.0829993 0.0000247 -0.8450241 0.3020022 -0.000004 0.0000003 -0.0000036 0.0944276 -0.3074131 -0.0628105 -0.000013 -0.0498164 0.9192521 -0.0000028 0.0000127 0.0000236 -0.0851012 -0.2827789 0.0645169 0.0000031 0.0425594 0.941867 0.0000531 -0.0000029 0.0001 -0.0835165 0.1020461 -0.0111522 0.0000223 -0.2025979 1.0676942 0.0000876 0.0000102 0.0000987 -0.0750886 -0.6194936 -0.0685525 -0.0000182 -0.1209412 -0.110984 -0.0000127 -0.0000276 -0.0000028 -0.122925 0.6473941 0.4901601 0.0000727 0.5984576 0.0212967 0.0000268 0.0000878 0.000023 -0.027083 0.6333798 -0.4879517 -0.0000553 -0.601242 0.0312488 0.0000007 -0.0000578 -0.0000123 -0.0288382 -0.3564441 -0.1401034 -0.0000214 -0.1447266 -0.4004477 -0.0000431 -0.0000201 -0.0000414 -0.0735292 1.130926 0.3999995 0.0001093 0.5127146 0.5033566 0.0000602 0.0001488 0.0000589 -0.0655341 0.1166337 0.0198762 -0.0000051 0.0163713 0.0522413 -0.000003 -0.0000094 -0.0000138 0.1862868 0.0536154 0.0296623 -0.0000086 0.0254341 0.0882513 0.0000006 -0.0000124 -0.000005 0.1752445 unknown
polarizability: 318.9399087|8.7502988|239.8734269|0.0043404|0.0062691|66.459032 unknown
InChI: InChI=1S/C12H2Cl6O2/c13-3-1-4(14)10-5(2-3)19-11-8(17)6(15)7(16)9(18)12(11)20-10/h1-2H
charge 0 multiplicity 1
22 atoms
Cl -1.998331 -3.133437 0.000025
Cl -1.995347 3.282454 0.000148
Cl -4.824496 -1.539233 -0.000086
Cl -4.823037 1.691224 0.00015
Cl 2.80555 -3.123143 -0.000116
Cl 5.549692 1.705216 0.000326
O  0.367879 -1.382847 -0.000094
O  0.370214 1.526702 -0.000069
C  -0.828634 -0.634244 0.000002
C  -0.828368 0.780749 -0.000028
C  1.570489 -0.634033 -0.00002
C  1.578081 0.781467 -0.000031
C  -2.046306 -1.339483 0.000047
C  -2.044852 1.487338 0.000033
C  2.798728 -1.319802 0.000018
C  2.775965 1.509311 0.000024
C  -3.273183 -0.632201 0.000028
C  -3.272763 0.782229 0.000066
C  4.023442 -0.618339 0.000118
C  3.987019 0.788387 0.000138
H  2.746239 2.600985 0.000042
H  4.970317 -1.162898 0.000181
