program: Gaussian 09
title: 000042674
version: EM64L-G09RevD.01
frameworkgroup: C1[X(C17H24O)]
method: RPBEPBE
basis: SDD
operation: Freq
keyword: #pfreq=noraman
keyword: PBEPBE/SDD
title: #p freq=noraman PBEPBE/SDD
converged: YES YES NO NO
title: Mulliken charges:
elementType: O C C C C C C C C C C C C C C C C C H H H H H H H H H H H H H H H H H H H H H H H H
charge: -0.217562 0.171654 0.179070 -0.491702 -0.492800 0.332034 0.349859 -0.743301 -0.740296 -0.745770 -0.739847 -0.634583 -0.585310 0.411348 0.192549 -0.574305 -0.251856 -0.673724 0.203019 0.210264 0.203905 0.209112 0.215871 0.223784 0.228772 0.224380 0.210037 0.216721 0.230541 0.223235 0.214640 0.220498 0.212907 0.221435 0.233610 0.271087 0.212628 0.220895 0.177484 0.225608 0.220586 0.223519
chargesum: 0.00000
title: Mulliken charges with hydrogens summed into heavy atoms:
elementType: O C C C C C C C C C C C C C C C C C
charge: -0.217562 0.171654 0.179070 -0.078419 -0.079783 0.332034 0.349859 -0.074873 -0.089157 -0.077354 -0.085007 -0.400973 -0.314223 0.411348 0.192549 -0.140781 -0.074372 -0.004011
polarizability: 2.32242621e+02 -7.29744018e+00 2.05470019e+02 2.43405470e+00 1.62911337e+00 1.28339732e+02
1716.lowfreq: -17.8796 -9.5161 -0.0006 0.0000 0.0005 10.4207 37.4108 45.8729 68.0880
frequency: 36.8119 45.3954 68.0812 86.2212 138.5049 145.3233 151.8189 194.7767 203.9236 210.1069 214.4622 234.4020 236.9193 247.9320 258.0706 268.5015 280.7881 302.0391 312.9246 340.2560 360.0378 366.9648 382.2031 439.9351 456.3165 464.9410 482.4386 504.5964 538.9615 575.6385 580.7101 632.8859 682.3596 688.0468 767.5474 776.3016 790.6562 794.0194 844.3907 886.3779 912.7814 926.6085 929.3599 933.0705 937.8279 945.2518 962.1940 968.3628 988.4398 1002.7220 1012.4917 1021.8426 1057.1411 1059.4845 1063.0767 1083.7961 1112.4048 1144.2917 1181.9066 1184.5870 1201.2298 1216.2119 1228.8807 1238.6470 1242.2169 1260.2346 1278.1738 1301.3862 1313.0650 1344.3480 1344.8905 1361.7182 1374.3743 1375.9041 1385.1581 1391.3575 1394.2912 1398.7137 1401.3866 1453.8878 1460.1879 1463.7332 1465.8094 1471.9994 1472.5986 1475.9605 1477.4809 1480.1904 1482.2685 1486.6839 1490.9180 1492.7109 1495.8030 1546.6446 1584.4013 1623.8605 2904.7201 2971.8419 2972.7421 2973.8920 2975.1361 2977.3631 2980.8910 2982.0422 2990.7158 3025.3476 3035.4305 3037.4907 3065.8252 3066.3146 3070.8436 3071.7012 3076.3433 3077.5837 3079.7801 3081.1578 3082.6544 3083.9255 3121.6416 3137.8321
redmass: 3.8506 2.9010 2.7422 3.7608 3.4160 3.7613 3.1791 1.4404 1.1448 1.7058 1.2635 2.1454 1.7452 1.2888 1.1671 2.6597 2.7598 2.4386 2.5427 2.4219 2.4944 2.6238 2.5971 3.0705 2.8517 3.3644 3.2362 2.8094 3.6086 3.3473 3.3748 3.4325 6.0221 5.1223 2.3839 3.1767 1.2145 3.5262 2.1984 2.0261 1.5201 1.5106 1.5605 1.6723 1.4717 2.4451 1.9093 1.5164 1.8128 1.2711 2.7470 1.4594 1.6071 1.8330 1.8603 1.6525 1.8848 3.1562 3.2558 1.5964 2.5948 3.1652 2.5682 2.1902 1.2918 1.9625 1.2788 1.9080 1.8108 1.4705 1.4556 3.5635 1.1864 1.1963 1.9223 1.3502 1.2684 1.4564 1.6984 1.0660 1.0588 1.0510 1.0796 1.1392 1.0566 1.1572 1.1657 1.0659 1.0570 1.0888 1.0930 1.5121 1.1530 8.7231 6.1824 6.7250 1.0840 1.0367 1.0388 1.0482 1.0402 1.0422 1.0355 1.0556 1.0603 1.0993 1.1025 1.1010 1.0995 1.0996 1.0989 1.0985 1.0999 1.1000 1.1001 1.0992 1.0991 1.1010 1.0892 1.0895
irintensity: 1.0548 0.2220 1.3311 0.4401 1.2301 4.1049 4.1129 1.0857 0.4346 0.5442 0.1826 0.9520 1.8355 0.5222 0.3604 0.0578 0.2099 0.5663 0.5486 0.7013 0.6208 0.7092 0.0769 4.2743 2.5449 2.2569 3.5425 1.0526 4.6817 11.5328 0.3569 3.8435 2.6072 1.6503 3.1167 0.2172 3.4407 13.9183 1.2595 1.9151 10.8515 0.7942 0.0906 3.4035 6.5800 6.0271 2.5303 0.9784 7.9455 1.2340 21.8443 3.3401 12.4726 8.9257 12.7482 3.3616 17.3400 19.5925 1.0620 21.0944 3.5720 18.8427 16.3009 48.8582 0.1213 3.0653 2.8460 5.0126 3.7235 9.8946 0.3178 9.0160 2.1754 36.2441 18.5758 5.6980 16.1390 20.2754 24.8350 0.0862 1.0028 0.4557 0.7367 13.6253 6.8134 9.4738 6.0228 3.0132 28.3702 1.8787 16.5177 40.5038 25.4330 13.6169 303.9310 14.7946 129.3081 12.6215 16.8945 33.7133 3.2028 81.2344 43.7007 46.6273 33.0546 38.3723 46.2019 8.1208 3.7760 7.8087 27.5475 128.3657 13.5817 30.2083 44.2175 56.1894 28.3731 35.1073 25.1531 2.6177
temp: 298.150 k
press: 1.00000 atm
elementType: 8 6 6 6 6 6 6 6 6 6 6 6 6 6 6 6 6 6 1 1 1 1 1 1 1 1 1 1 1 1 1 1 1 1 1 1 1 1 1 1 1 1
symmnumber: 1
zpe: 955462.0 jmol-1
zpe.correction: 0.363916 hartree
zpe.thermalcorrener: 0.382899 hartree
zpe.thermalcorrenthalpy: 0.383844 hartree
zpe.thermalcorrgfe: 0.318262 hartree
zpe.sumelectzpe: -736.070459 hartree
zpe.sumelectthermal: -736.051476 hartree
zpe.sumelectthermalent: -736.050532 hartree
zpe.sumelectthermalfe: -736.116113 hartree
dipole: 2.4494 -3.7985 0.0159
dipole: 4.5198
quadrupole: -108.5654 -116.3021 -111.7361
quadrupole: 13.4804 0.7172 0.9763
quadrupole: 3.6358 -4.1009 0.4651 13.4804 0.7172 0.9763
hfenergy: -736.4343752 hartree
pointgroup: C01 [X(C17H24O1)]
dipole: -1.0234732 -1.4522901 0.0740801 debye
polarizability: 232.8369809|6.0891611|204.7120756|-1.1768099|-4.4267343|128.5033158 unknown
InChI: InChI=1S/C17H24O/c1-6-12-9-14-15(10-13(12)11-18)17(4,5)8-7-16(14,2)3/h9-11H,6-8H2,1-5H3
charge 0 multiplicity 1
42 atoms
O  3.300422 2.579879 -0.077589
C  -1.929649 -1.529539 0.13036
C  -1.807815 1.571495 -0.165421
C  -3.105948 -0.639011 -0.361909
C  -3.076041 0.772531 0.245841
C  -0.602664 -0.739515 0.100272
C  -0.548706 0.687925 -0.019101
C  -2.197261 -2.002819 1.593057
C  -1.86427 -2.780411 -0.793879
C  -1.926012 2.038516 -1.648691
C  -1.721845 2.830664 0.744444
C  0.616448 -1.457137 0.234151
C  0.722779 1.300628 -0.033788
C  1.888887 -0.848799 0.229177
C  1.93397 0.574089 0.084998
C  3.137743 -1.719256 0.326708
C  3.211485 1.326762 0.069513
C  3.809774 -1.963489 -1.052317
H  -4.059163 -1.144599 -0.111208
H  -3.068877 -0.568822 -1.467215
H  -3.971491 1.343198 -0.069569
H  -3.119956 0.704346 1.351243
H  -3.124057 -2.605954 1.633605
H  -1.364764 -2.625606 1.967631
H  -2.309711 -1.147934 2.28326
H  -1.564311 -2.501044 -1.820395
H  -1.156374 -3.543618 -0.425174
H  -2.863054 -3.253875 -0.844077
H  -1.022379 2.59394 -1.958409
H  -2.044139 1.184279 -2.339255
H  -2.799778 2.70647 -1.770856
H  -0.92297 3.524702 0.429654
H  -2.678577 3.384798 0.700349
H  -1.535135 2.549261 1.797029
H  0.5758 -2.547568 0.342921
H  0.817492 2.387949 -0.131663
H  3.878684 -1.276852 1.01912
H  2.855611 -2.696723 0.761016
H  4.140047 0.722867 0.206616
H  3.102742 -2.442709 -1.753111
H  4.691428 -2.621676 -0.946922
H  4.143134 -1.015049 -1.511217
