program: Gaussian 09
title: 000042666
version: EM64L-G09RevD.01
frameworkgroup: C1[X(C13H15NO3)]
method: RPBEPBE
basis: SDD
operation: Freq
keyword: #p
keyword: freq=noraman
keyword: PBEPBE/SDD
title: #p freq=noraman PBEPBE/SDD
converged: YES YES NO NO
title: Mulliken charges:
elementType: O O O N C C C C C C C C C C C C C H H H H H H H H H H H H H H H
charge: -0.226926 -0.222781 -0.287492 -0.424045 0.361254 -0.493186 -0.186791 0.150920 -0.716336 -0.707896 0.173802 0.259485 -0.348519 -0.347948 -0.225165 -0.242078 -0.225810 0.272747 0.236054 0.295178 0.234465 0.234426 0.217049 0.219518 0.241311 0.232430 0.337621 0.274919 0.215383 0.232855 0.232049 0.233508
chargesum: 0.00000
title: Mulliken charges with hydrogens summed into heavy atoms:
elementType: O O O N C C C C C C C C C C C C C
charge: -0.226926 -0.222781 -0.287492 -0.086424 0.361254 0.015615 0.108387 0.150920 -0.030397 -0.014637 0.173802 0.259485 -0.073600 -0.132565 0.007690 -0.010029 0.007698
polarizability: 2.17150484e+02 9.79912815e+00 1.53451531e+02 5.72325665e+00 2.70778520e+00 9.13956251e+01
1716.lowfreq: -7.4678 -3.5751 -0.0011 -0.0009 -0.0006 6.0510 19.2383 37.9908 54.3686
frequency: 18.0447 37.9170 54.3442 60.3266 108.1804 115.0056 167.9836 187.1500 193.0232 212.7678 227.5940 296.1227 303.2451 326.1258 357.2799 397.0813 404.9706 432.8646 443.6695 467.4196 523.8297 544.9133 567.3817 586.4025 614.0609 660.0873 664.4168 689.5304 701.5437 752.8305 794.8218 806.6062 852.0797 854.2450 884.8042 927.6054 935.2716 939.5802 977.1662 985.0652 986.3804 989.9998 1007.1255 1023.1209 1029.9656 1074.9671 1087.1053 1101.0733 1117.2544 1170.4896 1173.5609 1186.8713 1197.8098 1220.0379 1254.6327 1263.5371 1290.8239 1301.6910 1320.6745 1347.6125 1384.7031 1385.2402 1399.9627 1432.7710 1452.1572 1463.6979 1466.1526 1471.7595 1474.7536 1483.8771 1498.2684 1562.9180 1602.4167 1611.4043 1684.7554 2971.1163 2991.3654 2994.5695 3029.2712 3087.6284 3091.6596 3098.7100 3103.4510 3117.1922 3118.7492 3132.6605 3145.9174 3158.8952 3170.1335 3526.3871
redmass: 3.8674 4.8966 5.7014 4.3320 5.1193 3.9554 4.3959 1.1137 3.9159 6.9139 1.0898 2.9473 4.0444 2.7969 3.3063 2.7614 3.5379 4.4264 3.1857 4.2074 3.3824 1.6740 2.2344 6.9833 6.3984 5.7283 4.6290 4.4702 1.5201 6.4832 2.4569 4.1645 1.4129 3.3421 3.0896 1.6852 1.4455 1.6743 1.5161 1.3937 2.4818 4.4912 1.3437 2.1405 1.9847 1.9987 1.6937 2.3599 2.7442 2.1686 1.0743 1.6250 1.5539 1.7057 2.0103 2.4777 2.0847 1.8892 1.3640 1.4357 1.2479 9.0359 1.2074 2.2398 1.0529 1.0495 2.0403 1.0678 1.0877 1.0562 2.3458 7.2282 6.6650 6.0398 12.0544 1.0812 1.0358 1.0363 1.0643 1.0991 1.0992 1.1004 1.1003 1.1013 1.0879 1.0869 1.0919 1.0956 1.1009 1.0774
irintensity: 0.4218 1.4497 8.8114 6.6494 1.0310 1.1597 6.9548 0.2322 11.2180 3.2424 0.4895 0.7360 4.9092 2.0539 1.9285 0.0269 2.1962 4.5334 5.4136 2.4638 14.8645 42.9845 26.2872 30.1049 0.8177 9.7608 7.7276 1.5267 117.2250 6.4149 18.2333 9.0825 6.9245 39.0143 8.3340 1.8805 2.8572 7.4108 1.9684 0.8279 17.2949 1.6921 1.2029 5.1930 12.0725 45.8491 54.6050 11.2965 186.0289 25.0585 0.6273 0.9773 6.6406 2.2929 49.1414 94.3866 58.5230 81.2883 10.3124 2.9221 33.4784 1.6098 22.8497 4.8910 1.4590 3.9929 213.7891 11.4731 4.4110 11.5233 213.6737 122.7398 43.8222 7.9451 264.6293 19.7092 15.3126 14.4953 13.9069 12.9503 25.3894 12.5677 36.5280 10.7915 11.2221 1.6995 20.1856 14.8202 22.2160 35.8304
temp: 298.150 k
press: 1.00000 atm
elementType: 8 8 8 7 6 6 6 6 6 6 6 6 6 6 6 6 6 1 1 1 1 1 1 1 1 1 1 1 1 1 1 1
symmnumber: 1
zpe: 671886.4 jmol-1
zpe.correction: 0.255908 hartree
zpe.thermalcorrener: 0.271952 hartree
zpe.thermalcorrenthalpy: 0.272896 hartree
zpe.thermalcorrgfe: 0.210867 hartree
zpe.sumelectzpe: -783.586082 hartree
zpe.sumelectthermal: -783.570038 hartree
zpe.sumelectthermalent: -783.569094 hartree
zpe.sumelectthermalfe: -783.631123 hartree
dipole: 0.1365 -1.6654 1.6005
dipole: 2.3139
quadrupole: -79.0954 -109.4743 -101.2619
quadrupole: 15.2785 1.5293 -0.6646
quadrupole: 17.5151 -12.8638 -4.6514 15.2785 1.5293 -0.6646
hfenergy: -783.84199 hartree
pointgroup: C01 [X(C13H15N1O3)]
dipole: -0.075011 -0.6150737 -0.6669182 debye
polarizability: 216.8192837|-11.4113824|153.9960236|3.5194412|1.0675777|91.1823319 unknown
InChI: InChI=1S/C13H15NO3/c1-13(2)8-10(12(16)17-13)14-11(15)9-6-4-3-5-7-9/h3-7,10,14H,8H2,1-2H3
charge 0 multiplicity 1
32 atoms
O  3.576652 1.013688 -0.15419
O  1.877326 2.483499 0.449593
O  -0.616118 -1.828878 0.517724
N  0.053233 0.324521 0.011863
C  3.688908 -0.490096 -0.472062
C  2.20426 -0.925496 -0.63194
C  1.446801 0.02849 0.322156
C  2.279322 1.323022 0.241615
C  4.508783 -0.582945 -1.760607
C  4.392691 -1.148087 0.726413
C  -0.928042 -0.635249 0.195623
C  -2.356576 -0.209236 -0.019877
C  -3.324659 -1.236712 -0.158803
C  -2.774898 1.147373 -0.063876
C  -4.683383 -0.917413 -0.35711
C  -4.136585 1.466311 -0.257778
C  -5.093327 0.435974 -0.410241
H  2.04075 -1.98192 -0.373182
H  1.861946 -0.755861 -1.668544
H  1.510757 -0.374611 1.35417
H  4.040371 0.008433 -2.565611
H  5.534201 -0.206913 -1.602803
H  4.570027 -1.636099 -2.090456
H  4.58467 -2.214748 0.511847
H  5.358654 -0.651729 0.920516
H  3.782908 -1.088539 1.644991
H  -0.173675 1.300456 -0.194904
H  -2.983014 -2.275278 -0.100254
H  -2.062457 1.968571 0.081299
H  -5.421938 -1.718818 -0.467565
H  -4.451107 2.515254 -0.282412
H  -6.149181 0.686238 -0.561695
