program: Gaussian 09
title: 000042652
version: EM64L-G09RevD.01
frameworkgroup: C1[X(C8H6N4O3S)]
method: RPBEPBE
basis: SDD
operation: Freq
keyword: #p
keyword: freq=noraman
keyword: PBEPBE/SDD
title: #p freq=noraman PBEPBE/SDD
converged: NO NO NO NO
title: Mulliken charges:
elementType: S O O O N N N N C C C C C C C C H H H H H H
charge: 0.254547 -0.208720 -0.230038 -0.169852 -0.405714 0.016798 0.036138 -0.308713 0.326704 0.353149 -0.437187 0.320702 -0.318359 -0.688056 -0.206837 -0.049350 0.322895 0.329867 0.300516 0.265100 0.326948 0.169462
chargesum: 0.00000
title: Mulliken charges with hydrogens summed into heavy atoms:
elementType: S O O O N N N N C C C C C C C C
charge: 0.254547 -0.208720 -0.230038 -0.169852 -0.075848 0.016798 0.036138 0.018235 0.326704 0.353149 -0.114292 0.320702 -0.017843 -0.422956 -0.206837 0.120113
polarizability: 2.41638513e+02 8.92178450e+00 1.79854622e+02 -1.67703964e-02 3.76844886e-02 5.32677119e+01
1716.lowfreq: -13.7442 -5.2575 -0.0017 -0.0012 0.0007 1.9135 9.7529 23.6006 54.6377
frequency: 5.5073 23.5715 54.6376 57.9839 94.9287 129.9282 166.9858 199.3698 211.3135 262.9076 282.6550 308.1473 330.8040 409.4215 458.4628 522.0319 545.6336 549.6022 562.3205 579.5941 601.1606 602.2122 622.3007 678.5894 703.3555 730.4062 736.8684 768.2790 819.3903 832.3997 870.5525 877.4062 944.7123 953.1438 953.9319 997.7492 1041.1529 1118.3641 1129.0364 1166.6483 1207.8299 1231.4270 1291.7883 1351.5071 1357.2864 1387.3308 1408.7213 1425.7346 1443.5355 1474.3157 1517.7627 1577.3484 1617.6423 1670.2067 2930.6884 3232.8710 3258.0762 3263.3797 3531.0132 3599.7975
redmass: 7.3898 6.0496 9.6334 11.4781 5.9060 10.6240 4.0831 5.3807 8.0946 12.2195 12.1636 5.0568 4.2402 6.5657 9.1942 8.2610 4.6591 7.5851 8.1114 2.8432 1.5144 1.2219 4.3409 2.0814 4.8082 2.1049 12.4602 6.6240 1.5167 7.9158 6.7808 1.4493 1.6290 6.3491 3.3416 5.6093 1.9861 1.7620 1.4785 1.8104 3.5364 2.3254 3.4623 8.8888 11.4039 1.1735 4.0866 4.5212 7.0468 1.7427 4.9212 6.8970 6.7993 5.8603 1.0874 1.0956 1.0993 1.1006 1.0779 1.0813
irintensity: 1.8092 7.0635 0.2057 0.2894 6.9537 10.7023 18.9198 2.2939 0.6328 0.2151 1.0575 0.4777 2.0750 4.2628 5.9893 5.4113 13.5267 2.8014 32.5789 31.4331 0.7484 146.4522 4.2285 11.7568 20.3178 88.0392 10.1945 45.5008 8.0983 1.7993 3.2179 45.2841 0.2865 9.6255 24.0638 20.5146 59.3293 3.5739 99.9157 34.5052 183.4091 50.2552 229.6550 45.7883 76.9283 2.0877 9.2791 97.7571 10.5710 464.8097 30.2049 220.8905 48.8310 174.2921 124.5122 8.5617 13.3239 11.4044 37.4948 52.9307
temp: 298.150 k
press: 1.00000 atm
elementType: 16 8 8 8 7 7 7 7 6 6 6 6 6 6 6 6 1 1 1 1 1 1
symmnumber: 1
zpe: 374920.0 jmol-1
zpe.correction: 0.142799 hartree
zpe.thermalcorrener: 0.157069 hartree
zpe.thermalcorrenthalpy: 0.158013 hartree
zpe.thermalcorrgfe: 0.097142 hartree
zpe.sumelectzpe: -1149.953381 hartree
zpe.sumelectthermal: -1149.939111 hartree
zpe.sumelectthermalent: -1149.938167 hartree
zpe.sumelectthermalfe: -1149.999039 hartree
dipole: -8.0743 -7.5328 0.0010
dipole: 11.0425
quadrupole: -97.8197 -96.7739 -100.7238
quadrupole: -18.0098 -0.0279 0.0160
quadrupole: 0.6195 1.6652 -2.2847 -18.0098 -0.0279 0.0160
hfenergy: -1150.0961806 hartree
pointgroup: C01 [X(C8H6N4O3S1)]
dipole: 2.930241 -3.2074718 -0.0003934 debye
dipolederiv: -0.503756 0.3417444 -0.0000618 -0.0897605 -0.4442184 0.0001635 -0.0000183 0.0002726 0.116987 -0.5027284 0.0033318 0.0000377 0.1455756 -0.8857011 0.0004075 -0.000032 0.0005558 -0.2354019 -1.1125403 0.0532427 0.0002001 -0.0276903 -0.4689855 0.000209 0.000124 0.0001234 -0.2504921 -0.2721273 0.5707315 0.0005352 -0.178376 -0.9581821 -0.0004249 -0.0000808 -0.0010926 -0.299954 -0.3252985 0.4214304 -0.0002094 0.154967 -0.4577724 0.0000839 -0.0000687 -0.0001318 -0.2095118 -1.0721047 0.0730443 -0.0000031 0.1122939 -0.3469508 0.0001447 0.0002573 0.0001499 -0.1569215 1.7398384 -0.3732673 -0.0000854 -0.5826406 1.4645995 -0.0008104 0.0000407 -0.0007891 0.2095341 -0.7605051 -0.4726624 -0.0001164 -0.8922161 -1.6161056 -0.0001636 -0.0002398 -0.000356 -0.3360333 -0.0333424 0.11673 -0.0000227 0.3792878 -0.0126479 -0.0000447 -0.0004819 0.0001292 -0.0107809 0.9457993 -0.1268695 -0.0000668 0.0030151 0.1158404 -0.0000346 0.0000247 0.0000676 0.1178324 0.2994558 -0.1968868 0.0000875 -0.0636981 -0.0594488 -0.0000632 -0.0001076 0.0000253 -0.1478412 -0.5046078 0.3604758 -0.000196 0.4626273 -0.4615933 0.0002098 -0.0000665 0.0001973 -0.0008758 -0.2333994 -0.3006221 0.000114 -0.3747958 0.4656647 -0.0002489 0.0003014 -0.0003078 -0.1062877 0.1653211 -0.2358552 0.0000088 0.142981 -0.1868739 0.0000154 -0.000064 0.0000179 -0.3704256 1.1783667 0.3907025 0.0001015 0.339958 1.2326209 -0.0006086 -0.0001354 -0.0007837 0.0582239 0.5986445 -0.4570484 -0.0008469 0.6030856 2.0186085 0.0010771 -0.0002443 0.0016251 0.1747861 0.1376925 -0.011251 0.0000103 -0.0612226 0.120359 0.0000507 0.0000671 0.0000181 0.2004812 0.2102524 0.0765132 -0.0000179 0.0203546 0.2188217 0.0000695 -0.0000316 0.0001208 0.3201286 0.1009912 -0.0193456 0.0000508 -0.0100828 0.092909 0.0000881 0.0000425 0.0000952 0.2188062 0.0312332 -0.0794845 0.0000423 -0.0884566 0.0506672 0.0000523 0.0000937 -0.0000524 0.238713 0.2086229 0.0051699 0.0001324 0.0274802 0.0986275 -0.0001183 0.0002114 0.0000364 0.3433182 -0.2958081 -0.1398236 0.0003056 -0.0226867 0.0197614 -0.0000542 0.0004082 0.0000787 0.1257148 unknown
polarizability: 239.8274689|-13.7190271|181.6656664|-0.0197218|-0.0362273|53.2677119 unknown
InChI: InChI=1S/C8H6N4O3S/c13-4-10-8-11-7(3-16-8)6-1-5(2-9-6)12(14)15/h1-4,9-10H
charge 0 multiplicity 1
22 atoms
S  3.253752 -2.152082 0.000485
O  -3.474949 2.303868 -0.001209
O  -4.978174 0.575369 0.000388
O  3.048622 2.701458 0.001667
N  -1.585409 -1.847113 0.001145
N  1.681947 0.032854 -0.000277
N  -3.766855 1.044192 -0.000057
N  4.052431 0.543529 -0.000861
C  -0.608537 -0.828689 0.000512
C  0.825382 -1.088163 0.000402
C  -1.279731 0.401659 -0.000364
C  -2.678693 0.09682 0.000239
C  -2.852002 -1.298558 0.001222
C  1.463875 -2.325139 0.000684
C  2.946976 -0.30952 -0.000388
C  4.048964 1.959219 0.000092
H  -0.813386 1.382859 -0.001101
H  -1.390448 -2.846951 0.001797
H  -3.766369 -1.884435 0.001919
H  1.042236 -3.328001 0.000934
H  4.975587 0.102252 -0.001923
H  5.099081 2.333372 -0.000605
