program: Gaussian 09
title: 000042655
version: EM64L-G09RevD.01
frameworkgroup: C1[X(C10H10N4O2S2)]
method: RPBEPBE
basis: SDD
operation: Freq
keyword: #p
keyword: freq=noraman
keyword: PBEPBE/SDD
title: #p freq=noraman PBEPBE/SDD
converged: YES YES NO NO
title: Mulliken charges:
elementType: S S O O N N N N C C C C C C C C C C H H H H H H H H H H
charge: 0.283333 0.283327 -0.262802 -0.262784 -0.385221 -0.385181 -0.049178 -0.049181 -0.547827 -0.547917 0.235572 0.235569 0.350424 0.350416 -0.620037 -0.620039 -0.461930 -0.461936 0.293508 0.232835 0.232870 0.293575 0.331368 0.331388 0.325012 0.324999 0.274918 0.274918
chargesum: 0.00000
title: Mulliken charges with hydrogens summed into heavy atoms:
elementType: S S O O N N N N C C C C C C C C C C
charge: 0.283333 0.283327 -0.262802 -0.262784 -0.053853 -0.053793 -0.049178 -0.049181 -0.021483 -0.021472 0.235572 0.235569 0.350424 0.350416 -0.295025 -0.295040 -0.187012 -0.187018
polarizability: 2.90195756e+02 1.27380933e+00 1.45662793e+02 3.76902771e-02 1.60075103e-03 9.58623860e+01
1716.lowfreq: -10.4909 -2.1056 -0.0010 0.0009 0.0020 4.6733 13.6072 24.4730 27.2695
frequency: 13.5175 23.7698 27.2329 67.6146 79.2200 87.7624 100.4467 103.9579 127.4327 163.3570 187.7756 278.8251 288.8255 310.4943 344.0198 345.4194 382.3411 468.7117 468.7762 543.2696 557.2916 571.6100 592.5342 637.4615 643.0780 649.8678 651.5052 670.5575 688.8990 689.6150 728.7388 735.3466 735.4720 778.9307 791.6624 806.0318 806.4800 811.1651 816.2831 831.6101 928.3407 937.1224 940.0648 958.7263 1016.9515 1077.8193 1117.1244 1121.7970 1154.2060 1187.8531 1199.2910 1210.6883 1212.7957 1244.8092 1273.6586 1276.5699 1331.1556 1365.0639 1440.7284 1441.0781 1444.8347 1453.3366 1498.6616 1506.3100 1549.7991 1550.9648 1605.2398 1613.5184 2978.0715 2984.4787 3031.2957 3052.8420 3233.9585 3233.9759 3281.3783 3281.4136 3532.9236 3533.0037
redmass: 7.7465 7.4016 7.4109 5.8444 8.1440 3.3567 6.0669 4.1296 5.6541 10.0094 7.1415 7.2185 5.9396 5.0213 8.6067 9.2206 4.7214 4.4587 4.5059 4.8985 5.6888 3.4625 7.0474 9.0895 2.8076 1.2971 1.7453 7.6111 3.6309 3.8448 3.5850 1.2156 1.2194 3.8766 5.5801 1.3402 1.2827 2.9907 4.9093 2.9109 3.7637 4.3720 4.3167 4.6979 2.0613 2.7205 1.4917 1.5588 1.2546 1.6840 1.7595 1.5460 1.5348 1.2579 2.0044 2.5772 1.7551 1.9622 6.6735 4.7260 1.1729 1.1185 2.6888 2.6027 6.6708 7.2722 6.6431 6.0532 1.0612 1.0601 1.0978 1.1005 1.0961 1.0961 1.0968 1.0968 1.0770 1.0770
irintensity: 0.2182 0.4063 1.1113 0.0314 2.3123 2.9941 5.7191 0.4723 8.5864 0.2171 36.8944 6.0651 3.2169 0.1473 6.0774 0.5820 30.8359 8.5885 3.7286 36.9426 0.4906 3.2458 11.3722 2.5404 34.3525 117.3834 9.8193 2.5809 15.9650 5.4006 1.6604 0.0934 0.0173 10.6677 37.5467 153.8373 50.4831 8.5566 48.1412 17.7331 12.1840 15.9904 42.1077 0.5131 10.6409 0.7188 7.0095 0.3761 0.5403 142.1371 0.1703 4.6802 1.4229 110.7106 37.4223 1.3682 40.4412 3.8300 218.6422 11.7480 4.6686 63.7564 975.7459 12.0006 208.2050 2.6726 161.6080 45.3591 3.4667 62.0424 12.9030 17.9576 0.5464 0.5617 12.8269 15.4198 50.4630 27.6832
temp: 298.150 k
press: 1.00000 atm
elementType: 16 16 8 8 7 7 7 7 6 6 6 6 6 6 6 6 6 6 1 1 1 1 1 1 1 1 1 1
symmnumber: 1
zpe: 516839.2 jmol-1
zpe.correction: 0.196854 hartree
zpe.thermalcorrener: 0.213846 hartree
zpe.thermalcorrenthalpy: 0.214790 hartree
zpe.thermalcorrgfe: 0.147906 hartree
zpe.sumelectzpe: -1551.340621 hartree
zpe.sumelectthermal: -1551.323629 hartree
zpe.sumelectthermalent: -1551.322684 hartree
zpe.sumelectthermalfe: -1551.389569 hartree
dipole: 0.0016 -0.0001 2.0955
dipole: 2.0955
quadrupole: -99.6814 -121.8668 -121.6477
quadrupole: -7.6070 0.0025 -0.0001
quadrupole: 14.7172 -7.4682 -7.2491 -7.6070 0.0025 -0.0001
hfenergy: -1551.5374746 hartree
pointgroup: C01 [X(C10H10N4O2S2)]
dipole: 0.0005396 0.0054076 -0.8243994 debye
polarizability: 290.0030181|-5.425413|145.853343|-0.0965847|0.3298523|95.8645742 unknown
InChI: InChI=1S/C10H10N4O2S2/c15-9(13-7-3-17-5-11-7)1-2-10(16)14-8-4-18-6-12-8/h3-6,13-14H,1-2H2
charge 0 multiplicity 1
28 atoms
S  6.677928 -0.877036 0.539679
S  -6.678677 0.866874 0.553027
O  2.030413 -1.273214 0.745918
O  -2.031218 1.264386 0.76225
N  3.028313 0.577029 -0.255278
N  -3.02815 -0.573148 -0.263058
N  5.323744 1.130987 -0.554656
N  -5.323214 -1.125459 -0.568078
C  0.574125 0.513211 -0.1363
C  -0.574074 -0.509124 -0.144597
C  1.919604 -0.156119 0.154376
C  -1.919828 0.155413 0.155754
C  4.376103 0.217439 -0.057267
C  -4.376148 -0.217474 -0.059524
C  4.882387 -0.918952 0.561048
C  -4.883148 0.910302 0.573795
C  6.556725 0.714734 -0.326897
C  -6.556451 -0.713412 -0.33415
H  0.359645 1.254946 0.659834
H  0.612341 1.078679 -1.086406
H  -0.611879 -1.059544 -1.103532
H  -0.359993 -1.2633 0.639896
H  2.895359 1.473667 -0.730463
H  -2.894655 -1.463349 -0.750057
H  4.330168 -1.738697 1.007777
H  -4.331438 1.724714 1.030799
H  7.456224 1.253889 -0.619182
H  -7.455603 -1.249641 -0.632809
