program: Gaussian 09
title: 000042622
version: EM64L-G09RevD.01
frameworkgroup: C1[X(C10H8N2O4)]
method: RPBEPBE
basis: SDD
operation: Freq
keyword: #p
keyword: freq=noraman
keyword: PBEPBE/SDD
title: #p freq=noraman PBEPBE/SDD
converged: YES YES NO NO
title: Mulliken charges:
elementType: O O O O N N C C C C C C C C C C H H H H H H H H
charge: -0.280754 -0.427124 -0.184114 -0.214897 0.036602 -0.016748 0.544597 0.220022 -0.527023 -0.332690 0.192146 -0.375817 -0.331833 0.252509 -0.510807 -0.182492 0.267388 0.259998 0.230715 0.287102 0.218153 0.261182 0.239533 0.374352
chargesum: 0.00000
title: Mulliken charges with hydrogens summed into heavy atoms:
elementType: O O O O N N C C C C C C C C C C
charge: -0.280754 -0.052772 -0.184114 -0.214897 0.036602 -0.016748 0.544597 0.220022 -0.259635 -0.072692 0.192146 -0.145102 -0.044731 0.252509 0.208062 -0.182492
polarizability: 2.97105536e+02 2.74609267e+00 1.57354989e+02 -2.06742323e+00 2.11266485e+00 5.84769512e+01
1716.lowfreq: -5.9780 -0.0007 -0.0007 -0.0005 4.4720 6.4760 31.3594 39.0636 57.3432
frequency: 31.2928 39.0161 57.3414 76.6995 90.8028 119.8815 147.8253 163.7198 212.9341 231.8350 247.4723 285.8680 297.6408 344.2495 381.9196 395.7672 401.4980 439.3050 461.2532 501.3482 551.3645 570.5041 577.7149 634.3316 694.7563 698.6244 730.5328 736.5623 767.1687 805.9624 808.2137 891.3622 896.2467 944.9948 988.9781 996.7005 1034.8812 1080.5926 1111.9717 1151.3240 1172.6040 1182.3776 1193.3461 1245.3108 1277.4737 1313.8321 1350.6411 1383.1678 1404.0201 1418.0940 1441.7073 1457.4348 1473.6788 1506.3640 1573.1779 1601.9200 1613.2211 2170.5458 2989.2608 3101.4883 3109.2121 3119.7011 3140.0630 3156.2572 3193.7153 3569.8675
redmass: 2.6214 3.2883 8.2693 8.9102 7.8494 1.9265 8.7248 3.5163 5.7767 6.1055 7.9117 4.4770 6.5631 4.3768 3.9203 1.1532 7.9821 7.2333 3.2237 13.5186 8.2665 8.3006 5.1279 3.7445 7.7498 9.8173 3.5232 8.4605 6.5509 1.6378 4.6941 2.1632 2.8317 1.3528 1.4382 3.9910 3.8144 2.2678 1.2363 1.3351 1.3809 7.7798 1.5292 2.0314 2.8943 1.8332 2.4952 9.0008 2.4817 4.5408 1.3424 1.0582 1.0553 3.0951 5.8731 7.0261 7.2124 12.6078 1.0338 1.0985 1.0872 1.0908 1.1054 1.0920 1.0939 1.0661
irintensity: 2.3017 5.3603 0.2622 0.6900 1.6848 3.1069 1.8429 7.0346 2.7529 2.3188 1.5725 2.1467 4.0305 15.7924 0.1673 144.9665 2.7753 1.5303 4.0530 0.6023 3.9351 23.3376 10.5445 19.3140 12.9131 4.5454 1.6716 6.0285 4.3579 36.7840 46.8458 4.8571 18.0366 0.0808 21.2677 68.8912 100.1966 172.7572 4.1166 63.7212 19.7680 796.9218 23.7504 93.0151 329.9777 45.3774 53.3113 113.1068 35.4525 5.1851 4.1328 19.2428 46.0880 117.0208 174.5368 322.3313 13.9024 20.5402 76.5149 34.3645 3.5659 12.7872 12.8959 1.2781 3.7187 110.5003
temp: 298.150 k
press: 1.00000 atm
elementType: 8 8 8 8 7 7 6 6 6 6 6 6 6 6 6 6 1 1 1 1 1 1 1 1
symmnumber: 1
zpe: 435195.1 jmol-1
zpe.correction: 0.165757 hartree
zpe.thermalcorrener: 0.180949 hartree
zpe.thermalcorrenthalpy: 0.181893 hartree
zpe.thermalcorrgfe: 0.121774 hartree
zpe.sumelectzpe: -794.975508 hartree
zpe.sumelectthermal: -794.960316 hartree
zpe.sumelectthermalent: -794.959372 hartree
zpe.sumelectthermalfe: -795.019491 hartree
dipole: 9.5097 1.5152 0.9006
dipole: 9.6716
quadrupole: -105.9965 -92.1909 -92.7360
quadrupole: 9.1326 5.2312 -2.6566
quadrupole: -9.0220 4.7835 4.2385 9.1326 5.2312 -2.6566
hfenergy: -795.1412652 hartree
pointgroup: C01 [X(C10H8N2O4)]
dipole: -3.701093 0.6426032 0.6065478 debye
dipolederiv: -1.3178341 0.5341936 -0.435734 0.5078814 -0.5632305 0.1173363 -0.6988658 0.3347293 -0.5425418 -1.8591708 -0.063682 0.3876657 -0.1482827 -0.3220386 -0.0852886 0.5062529 -0.1095497 -0.2832138 -1.1207637 0.1468227 -0.0402477 0.1648297 -0.2889642 0.1035374 -0.0815831 0.1093038 -0.3982241 -0.5275157 -0.0050973 0.089157 -0.2108639 -0.3525046 0.2897625 0.4738083 0.2345566 -0.7976616 2.2262938 -0.135707 -0.2713339 0.2177896 0.3838782 -0.4186411 -0.9292093 -0.326962 1.0542212 -0.2118384 -0.0126236 0.0198825 0.0692561 -0.2532073 0.0182698 -0.138732 0.0403357 -0.2745509 -1.101932 0.0290362 0.2178872 -0.0755792 0.0075665 -0.0196312 0.4512064 -0.0481547 -0.0399583 0.4789008 -0.378075 0.5985208 -0.6904778 0.2960642 -0.1869577 1.4295846 -0.4833624 0.3478836 0.3388613 0.1232579 -0.2918872 -0.1285638 -0.1458793 -0.0018336 0.2035193 -0.0930706 0.0168201 0.3223875 0.0108314 -0.1112536 0.1939869 -0.1166797 -0.0317059 -0.4549815 0.0195635 -0.0046948 1.6848601 0.0487123 -0.3622615 0.1561797 0.0602569 -0.0405132 -0.5977437 0.0505095 0.1241882 -0.6706339 0.0356776 0.0456161 0.2314378 -0.1205692 -0.1232592 -0.326522 -0.0756931 0.0550293 1.8408083 -0.194886 -0.1050129 -0.2435823 0.0154949 0.0304427 0.0077882 0.0220393 -0.0425082 -1.6038835 0.0949105 0.2527972 0.225878 0.0257418 0.0018212 -0.0227437 0.0353854 -0.0037923 0.8133828 -0.3281642 0.1653118 -0.3090506 0.4820933 -0.0060094 -0.1172015 0.1033958 0.1844911 -0.0328058 0.0265777 -0.0203081 -0.1215165 0.1289585 -0.0524884 0.2628255 -0.0902127 0.1892899 0.0969722 -0.0232739 0.0543911 0.0009246 0.1244703 0.0634902 0.0156066 0.0650678 0.0369506 0.0922922 0.0287713 -0.0408633 0.0233381 0.1244826 0.0481578 -0.0250013 0.0494288 0.0652944 0.0001296 -0.0226507 0.0780936 -0.0238351 0.1206994 0.0897555 0.0774809 0.0900189 -0.010736 0.1350696 0.0136358 -0.0261317 0.0020411 0.1212101 0.0370832 0.0002319 0.034844 0.0751537 -0.0316908 -0.0395853 -0.0808118 0.0453179 -0.0997433 -0.0663198 0.0608639 -0.1764923 0.0250796 -0.0283947 -0.0154046 0.0408409 -0.0768628 0.0201199 0.0369845 0.1727003 -0.0123505 0.0908493 0.0273987 0.0674771 -0.0556204 0.1038501 0.0501049 0.0727415 -0.1187363 0.0896188 -0.0599727 0.4491064 0.0592455 -0.1086976 0.0859036 0.3016753 0.1232654 -0.1505486 0.1370507 0.1926038 unknown
polarizability: 292.2372901|-32.1674566|86.9172183|-4.7385583|-41.9218656|133.7829678 unknown
InChI: InChI=1S/C10H8N2O4/c1-16-10-5-7(2-3-9(10)13)4-8(6-11)12(14)15/h2-5,13H,1H3
charge 0 multiplicity 1
24 atoms
O  -3.157575 0.989317 -1.535057
O  -4.056575 -0.227667 0.939641
O  4.959368 -0.745561 -0.145792
O  3.833139 0.300729 -1.838221
N  3.879003 -0.308103 -0.700592
N  2.836216 -1.771049 2.342504
C  0.066801 -0.139412 -0.069152
C  -2.292664 0.449016 -0.58279
C  -0.92561 0.447846 -0.912582
C  -0.355919 -0.733552 1.161272
C  -2.69272 -0.176708 0.640536
C  -1.715042 -0.742796 1.499195
C  1.439097 -0.075448 -0.534715
C  2.607465 -0.531775 0.041568
C  -4.314649 1.803473 -1.096103
C  2.759072 -1.207565 1.288984
H  -0.641187 0.918517 -1.859862
H  0.365319 -1.186217 1.844326
H  -2.036065 -1.21079 2.439018
H  1.601751 0.414442 -1.506139
H  -3.980449 2.621794 -0.43131
H  -5.064857 1.183376 -0.582585
H  -4.722311 2.220125 -2.028823
H  -4.219107 -0.711693 1.788081
