program: Gaussian 09
title: 000005028
version: EM64L-G09RevD.01
frameworkgroup: C1[X(C17H16Br2N2O2)]
method: RPBEPBE
basis: SDD
operation: Freq
keyword: #p
keyword: freq=noraman
keyword: PBEPBE/SDD
title: #p freq=noraman PBEPBE/SDD
converged: YES YES NO NO
title: Mulliken charges:
elementType: Br Br O O N N C C C C C C C C C C C C C C C C C H H H H H H H H H H H H H H H H
charge: 0.021626 0.065761 -0.220574 -0.310755 -0.426987 -0.598019 -0.322237 0.352084 0.622042 0.132886 -0.561671 0.495369 0.189980 -0.443457 -0.376003 -0.328366 -0.425567 0.171322 -0.191088 -0.191827 -0.813294 -0.237030 -0.794672 0.243985 0.391053 0.234767 0.236319 0.230702 0.259783 0.259436 0.225686 0.235702 0.226986 0.247320 0.335206 0.333406 0.237950 0.234818 0.257358
chargesum: 0.00000
title: Mulliken charges with hydrogens summed into heavy atoms:
elementType: Br Br O O N N C C C C C C C C C C C C C C C C C
charge: 0.021626 0.065761 -0.220574 -0.310755 -0.035933 0.070593 -0.078252 0.352084 0.622042 0.132886 -0.326904 0.495369 0.189980 -0.443457 -0.376003 -0.092046 -0.194866 0.171322 0.068695 0.067609 -0.124921 0.010289 -0.064546
polarizability: 2.97852812e+02 1.70455559e+01 2.65116825e+02 1.82842699e+01 1.60432096e+01 1.84087318e+02
1716.lowfreq: -0.8124 -0.0004 -0.0003 -0.0003 3.3046 7.3662 18.0910 22.8810 33.4748
frequency: 18.0216 22.8534 33.4516 52.7338 59.5506 65.5633 74.7973 89.6859 96.1407 103.8754 109.3439 139.0382 163.1753 172.9031 176.4772 186.5016 227.5249 259.1602 275.9158 296.7361 307.5247 317.0041 332.1554 343.4935 377.1445 416.2520 440.8266 454.1075 466.1571 511.7108 515.8845 517.2949 538.8782 563.1702 565.8786 580.7433 606.5890 617.8733 642.4170 669.4569 689.1414 699.8655 719.4609 731.8810 761.4375 780.1278 798.7837 840.4453 845.4097 862.8927 880.1003 902.6970 933.8791 949.7175 968.8335 977.9728 1021.0785 1022.8163 1023.1688 1042.3061 1045.5474 1052.0723 1069.3894 1112.8892 1143.0043 1169.0628 1185.3084 1202.1296 1209.2903 1254.4471 1276.3451 1288.8631 1293.6202 1320.6608 1324.7453 1362.4584 1368.1206 1390.5285 1395.8501 1407.9383 1410.2610 1413.0925 1451.4700 1455.8828 1466.3801 1467.7677 1484.5417 1513.3558 1550.8703 1561.7451 1575.7768 1585.9298 1588.3202 1634.1597 1654.1800 2976.6010 2987.0620 2987.6665 3054.7303 3073.1533 3087.5115 3123.2975 3130.7164 3151.3638 3152.6409 3159.4758 3171.3861 3173.2190 3184.4111 3508.5422 3661.4985
redmass: 5.6909 8.7155 6.3324 8.8086 1.0939 4.9391 7.4754 3.0346 6.3151 6.7431 8.1508 8.2099 1.1147 4.5233 5.6299 5.1505 5.0673 4.6404 4.7593 5.2514 5.0985 6.7618 6.6559 3.6142 5.6783 5.8756 2.8270 3.5495 2.2830 2.4118 2.6091 2.6307 3.3537 3.5831 4.6180 3.1206 2.7697 2.1106 4.8617 4.4280 6.9861 4.4004 4.4464 2.7106 4.2086 1.5103 1.3113 1.5092 1.5477 3.1050 4.5980 1.3572 2.2944 1.3311 2.2558 1.3412 1.9039 2.5564 2.8537 2.4293 1.7290 2.0154 2.4944 3.3933 1.7757 1.4568 1.3919 1.9744 2.4226 1.7342 1.4250 2.2827 3.3758 2.1570 1.7857 2.6677 1.3276 2.9402 1.2436 3.4734 3.3173 2.1078 1.2971 1.5627 1.0503 1.0468 1.8735 2.6350 6.2579 5.1104 6.3166 2.2512 1.3433 5.8081 5.0167 1.0374 1.0784 1.0391 1.0972 1.0974 1.0989 1.0989 1.0875 1.0904 1.0876 1.0955 1.0837 1.0929 1.0996 1.0445 1.1044
irintensity: 0.2017 0.6642 3.0522 1.7500 0.8133 3.9566 6.1163 0.1682 0.4508 0.3030 0.5945 0.2145 0.6959 0.0369 0.5152 0.4927 2.9140 4.8016 0.8718 3.7271 10.5411 7.9394 0.1345 0.8405 2.2446 4.3496 7.0658 13.6161 5.0355 44.1550 38.0688 39.0007 11.7504 1.2207 32.3238 16.4299 3.0573 39.4907 20.6512 4.9946 69.3452 18.0011 8.9742 3.3843 1.4115 49.9302 55.1746 10.7497 62.8576 3.6195 8.2922 0.0179 32.3889 0.2786 16.3717 0.0834 8.9957 16.8921 10.2811 6.9563 10.2777 0.3015 3.7053 19.9758 31.2081 11.9966 16.2079 3.1833 7.8878 10.8334 18.3616 55.1824 314.0992 18.9835 44.3969 19.4244 38.2734 95.9038 11.0062 6.0500 12.8742 68.8691 50.5075 11.2589 16.1197 12.1249 59.6435 212.1849 43.9682 81.9674 33.0812 241.9832 118.4192 234.6323 282.1514 30.5994 15.5755 4.6662 16.9940 12.8016 19.9398 11.9878 6.4366 26.6258 2.6106 13.1621 143.7984 1.2895 8.4003 27.3043 29.2202
temp: 298.150 k
press: 1.00000 atm
elementType: 35 35 8 8 7 7 6 6 6 6 6 6 6 6 6 6 6 6 6 6 6 6 6 1 1 1 1 1 1 1 1 1 1 1 1 1 1 1 1
symmnumber: 1
zpe: 766383.4 jmol-1
zpe.correction: 0.291900 hartree
zpe.thermalcorrener: 0.315101 hartree
zpe.thermalcorrenthalpy: 0.316045 hartree
zpe.thermalcorrgfe: 0.236013 hartree
zpe.sumelectzpe: -942.656557 hartree
zpe.sumelectthermal: -942.633355 hartree
zpe.sumelectthermalent: -942.632411 hartree
zpe.sumelectthermalfe: -942.712444 hartree
dipole: -3.1155 3.0104 -0.7172
dipole: 4.3913
quadrupole: -120.0875 -153.1084 -152.0362
quadrupole: 0.1522 -4.6041 6.8930
quadrupole: 21.6565 -11.3644 -10.2921 0.1522 -4.6041 6.8930
hfenergy: -942.9484567 hartree
pointgroup: C01 [X(C17H16Br2N2O2)]
dipole: 1.2755295 0.7569335 0.8859758 debye
polarizability: 297.1750616|-24.0803342|252.3761104|1.1789009|35.2002273|197.5057828 unknown
InChI: InChI=1S/C17H16Br2N2O2/c1-9-6-7-11(10(2)22)14(8-9)21-16(17(20)23)15-12(18)4-3-5-13(15)19/h3-8,16,21H,20H2,1-2H3
charge 0 multiplicity 1
39 atoms
Br 1.885021 2.072021 2.365783
Br 2.176499 -1.530794 -2.321878
O  -0.078791 1.396909 -2.683302
O  -0.880893 -2.738826 -0.279931
N  -0.253713 -0.203791 -0.320097
N  2.036841 2.164047 -2.107982
C  0.804761 0.787008 -0.440428
C  -1.579028 0.082871 -0.052815
C  2.138345 0.222309 0.057276
C  -2.518152 -1.011217 0.13325
C  -2.062439 1.425376 0.058893
C  -3.400959 1.710221 0.371815
C  0.882221 1.438761 -1.871598
C  2.736301 0.667906 1.271686
C  2.85307 -0.802507 -0.633661
C  -3.873475 -0.688146 0.443974
C  -4.315939 0.631525 0.573238
C  -2.09581 -2.415371 0.006837
C  3.944789 0.146701 1.77605
C  4.061148 -1.347668 -0.153245
C  -3.887666 3.144206 0.468516
C  4.606679 -0.869288 1.055881
C  -3.106001 -3.54165 0.211487
H  0.556628 1.640254 0.221013
H  -0.061932 -1.220616 -0.446734
H  -1.388167 2.262173 -0.145773
H  -4.589106 -1.503997 0.587181
H  -5.363117 0.845439 0.814437
H  4.356893 0.522433 2.715873
H  4.56529 -2.136721 -0.717137
H  -3.059557 3.866022 0.36825
H  -4.625404 3.364083 -0.326575
H  -4.389816 3.329682 1.436567
H  5.542863 -1.28826 1.437619
H  2.829436 2.145362 -1.467423
H  2.122321 2.662234 -2.993804
H  -3.933728 -3.477761 -0.518578
H  -3.549208 -3.511514 1.223764
H  -2.584103 -4.501114 0.076768
