program: Gaussian 09
title: 000042636
version: EM64L-G09RevD.01
frameworkgroup: C1[X(C11H13N5O3)]
method: RPBEPBE
basis: SDD
operation: Freq
keyword: #p
keyword: freq=noraman
keyword: PBEPBE/SDD
title: #p freq=noraman PBEPBE/SDD
converged: YES YES NO NO
title: Mulliken charges:
elementType: O O O N N N N N C C C C C C C C C C C H H H H H H H H H H H H H
charge: -0.126548 -0.236862 -0.194449 -0.149923 -0.061381 -0.083428 0.005357 0.014455 -0.409252 -0.376380 -0.373074 -0.365892 0.467981 -0.613584 -0.065740 -0.372743 -0.051501 -0.421927 0.389595 0.233683 0.298896 0.219080 0.241911 0.203571 0.228124 0.225865 0.195671 0.227979 0.230974 0.196622 0.232979 0.289940
chargesum: 0.00000
title: Mulliken charges with hydrogens summed into heavy atoms:
elementType: O O O N N N N N C C C C C C C C C C C
charge: -0.126548 -0.236862 -0.194449 -0.149923 -0.061381 -0.083428 0.005357 0.014455 0.123327 0.084611 0.058621 0.055644 0.467981 0.041991 -0.065740 -0.139765 -0.051501 -0.131987 0.389595
polarizability: 3.18050091e+02 4.92238986e+00 1.76907290e+02 -1.43034193e+01 2.28699049e+00 9.06399059e+01
1716.lowfreq: -0.0006 -0.0003 0.0003 2.0420 7.7018 10.9849 22.3942 43.7599 56.9577
frequency: 22.0379 43.5722 56.9482 73.7967 122.0607 154.8865 170.4779 182.2734 217.6644 223.9932 237.4979 251.9446 290.1000 313.5204 342.1579 365.0724 387.0813 411.0160 419.4594 470.1284 490.1959 512.4732 556.8580 569.6757 584.3159 614.0051 628.8541 660.7755 677.8988 710.3981 714.3908 740.6101 754.5299 811.9972 835.8139 850.5759 864.7884 930.2008 933.1088 976.5065 989.2737 1000.2485 1030.6119 1045.6928 1067.6815 1075.3607 1102.8403 1126.9689 1148.2938 1152.9211 1162.1029 1200.1439 1220.3072 1228.7265 1257.9120 1283.3186 1289.0286 1295.8027 1311.0442 1323.2076 1347.2337 1352.1301 1353.8213 1370.7994 1384.0654 1425.1427 1434.2605 1446.2452 1451.2011 1456.7973 1462.9454 1464.6649 1475.9480 1482.4075 1514.6710 1564.8440 1584.9305 2849.6392 2864.8585 2881.8249 2978.2303 2987.7452 3028.9160 3036.3953 3045.4057 3085.6521 3101.9547 3112.2462 3166.3334 3188.2663
redmass: 4.2816 3.8176 9.0505 6.7835 4.6951 4.7592 4.8663 3.9324 1.5213 5.4871 2.5365 4.2163 3.0251 2.2819 3.3780 3.8803 4.9317 3.1652 4.8486 2.8867 5.9646 5.2280 3.8821 9.9862 5.9509 5.3443 3.4003 4.7386 8.6461 9.1656 8.6791 8.1536 3.7204 1.5117 1.6793 10.4544 4.7245 10.4909 2.2224 1.3326 8.3201 2.5507 2.5396 1.7077 1.7237 1.8479 2.3453 1.6697 2.7911 2.6027 3.0582 1.1498 3.2347 2.1378 1.8174 2.6045 2.2020 1.7777 1.7539 2.9408 1.8320 2.7056 1.4058 1.4641 1.3996 2.8833 1.1821 7.0965 1.0903 1.0785 1.0978 1.1060 1.1054 1.0536 4.8837 7.3913 7.2084 1.0707 1.0682 1.0569 1.0671 1.0676 1.0753 1.0885 1.0901 1.1012 1.0969 1.0940 1.0889 1.0930
irintensity: 0.4882 1.2975 0.0275 1.4891 1.2643 5.0822 4.9638 0.6989 0.1704 0.3649 0.7840 3.5536 7.6635 4.6313 3.2867 0.8900 0.3214 2.8100 3.3088 0.0989 2.7336 2.3327 2.9321 1.5559 15.4140 2.0608 9.6847 1.8463 15.0860 8.1743 5.7286 5.3530 5.6516 42.6184 0.7026 14.7023 17.5445 19.3256 1.4105 4.3083 1.1832 67.0700 31.0111 6.8139 10.4793 0.5407 11.0199 18.1228 36.6213 31.7804 115.9674 7.8183 657.5956 85.3927 66.4653 14.3793 7.4993 37.7851 87.0103 10.7666 37.3949 55.0409 0.5627 6.8762 6.4994 15.1215 7.7572 52.4482 24.6614 4.5942 48.5246 12.6929 14.3622 10.8357 13.5863 454.2922 233.9136 53.6277 38.5331 183.4832 41.0757 49.1647 47.3897 43.1348 39.3821 26.3938 10.2398 11.8588 2.7137 10.1083
temp: 298.150 k
press: 1.00000 atm
elementType: 8 8 8 7 7 7 7 7 6 6 6 6 6 6 6 6 6 6 6 1 1 1 1 1 1 1 1 1 1 1 1 1
symmnumber: 1
zpe: 636322.0 jmol-1
zpe.correction: 0.242362 hartree
zpe.thermalcorrener: 0.258692 hartree
zpe.thermalcorrenthalpy: 0.259636 hartree
zpe.thermalcorrgfe: 0.197484 hartree
zpe.sumelectzpe: -924.813276 hartree
zpe.sumelectthermal: -924.796947 hartree
zpe.sumelectthermalent: -924.796003 hartree
zpe.sumelectthermalfe: -924.858154 hartree
dipole: 11.4013 -3.2783 -0.5864
dipole: 11.8778
quadrupole: -137.9597 -113.8338 -109.7868
quadrupole: -0.4583 6.6617 -0.2309
quadrupole: -17.4329 6.6930 10.7399 -0.4583 6.6617 -0.2309
hfenergy: -925.0556384 hartree
pointgroup: C01 [X(C11H13N5O3)]
dipole: -4.4640947 -1.0582256 0.8885832 debye
polarizability: 315.9797887|-13.4459966|165.2563257|-22.7502217|-29.1107296|104.3611728 unknown
InChI: InChI=1S/C11H13N5O3/c1-14-4-6-15(7-5-14)8-2-3-9(16(17)18)11-10(8)12-19-13-11/h2-3H,4-7H2,1H3
charge 0 multiplicity 1
32 atoms
O  1.283402 2.561329 -1.27943
O  4.503866 -1.999543 0.049654
O  4.707911 0.088139 -0.873915
N  -1.683661 -0.188923 0.469276
N  -4.559321 -0.150572 0.085721
N  0.094813 1.950104 -0.772952
N  2.447523 1.699937 -1.134013
N  4.009463 -0.859322 -0.334839
C  -2.439596 1.092377 0.407797
C  -2.531531 -1.312588 0.938197
C  -3.713165 0.941739 -0.44422
C  -3.809571 -1.422607 0.078954
C  -0.321064 -0.314804 0.293573
C  -5.863744 -0.25178 -0.59939
C  0.497138 0.735629 -0.31555
C  0.405281 -1.4830 0.66455
C  1.938602 0.580212 -0.539405
C  1.795044 -1.629695 0.448274
C  2.585349 -0.63619 -0.147257
H  -2.736169 1.3601 1.442236
H  -1.803561 1.888126 -0.002905
H  -1.98546 -2.263674 0.869067
H  -2.815225 -1.138941 1.995369
H  -3.424373 0.768657 -1.511971
H  -4.278659 1.889952 -0.396474
H  -4.446966 -2.219657 0.504434
H  -3.519757 -1.733982 -0.958158
H  -6.47688 -1.033186 -0.116699
H  -6.402701 0.707613 -0.509564
H  -5.77439 -0.49999 -1.68584
H  -0.105957 -2.305797 1.166696
H  2.30026 -2.548362 0.761784
