program: Gaussian 09
title: 000049351
version: EM64L-G09RevD.01
frameworkgroup: C1[X(C11H12N2O4)]
method: RPBEPBE
basis: SDD
operation: Freq
keyword: #p
keyword: freq=noraman
keyword: PBEPBE/SDD
title: #p freq=noraman PBEPBE/SDD
converged: NO YES NO NO
title: Mulliken charges:
elementType: O O O O N N C C C C C C C C C C C H H H H H H H H H H H H
charge: -0.426115 -0.259212 -0.265453 -0.247396 -0.456886 -0.457938 0.581726 0.572846 -0.618291 0.344067 -0.659455 -0.491110 0.097527 0.219957 0.209606 -0.797973 -0.798389 0.308830 0.267074 0.349020 0.322244 0.322010 0.241512 0.269793 0.238695 0.240389 0.269313 0.237779 0.385828
chargesum: 0.00000
title: Mulliken charges with hydrogens summed into heavy atoms:
elementType: O O O O N N C C C C C C C C C C C
charge: -0.040287 -0.259212 -0.265453 -0.247396 -0.134641 -0.135929 0.581726 0.572846 -0.309461 0.344067 -0.392381 -0.142090 0.097527 0.219957 0.209606 -0.047972 -0.050906
polarizability: 2.16482686e+02 -5.45146933e-01 1.92046726e+02 -3.29423517e-02 -8.55876257e-03 6.92575437e+01
1716.lowfreq: -79.8765 -77.2909 -6.1589 -0.0004 0.0004 0.0005 1.0781 5.2325 46.4408
frequency: -79.8752 -77.2887 46.4300 51.4322 61.7138 67.3693 93.9963 104.8183 115.3565 164.8678 204.7620 257.4421 259.2864 262.4140 287.5111 311.5032 392.3715 396.2392 488.5562 498.1130 524.9081 550.9768 563.2596 579.5379 606.3037 612.0978 616.0748 653.7119 666.7249 671.3748 706.8950 731.2673 746.6335 876.9395 910.1905 910.3653 936.9222 945.7357 961.1584 962.1796 981.4006 992.3167 1031.5158 1032.4193 1044.3740 1070.3280 1132.1123 1177.5593 1229.9942 1244.9846 1266.4821 1289.1422 1353.6408 1375.7734 1378.3221 1397.7856 1413.5773 1440.6294 1452.3288 1456.5861 1467.7959 1467.9814 1522.7798 1531.3999 1610.3820 1616.1816 1631.5495 1637.0470 1641.0518 2989.0177 2990.2459 3074.2633 3075.3848 3138.1181 3138.5255 3139.0373 3158.5249 3212.7810 3523.5433 3526.8999 3532.1610
redmass: 1.0465 1.0467 7.4958 7.1640 8.0348 3.7675 4.9877 3.8639 6.5571 4.9488 7.0849 3.7228 6.7389 4.0805 4.5078 4.5484 6.3704 5.8299 3.1608 4.9458 4.4602 4.6456 3.0786 2.8116 4.4082 1.3662 2.0263 1.2373 5.7487 1.6235 2.2414 5.3205 4.4152 5.3507 4.2672 1.5497 1.5598 5.9450 2.2862 1.4877 4.6923 1.9553 1.6702 1.6640 2.3732 2.4137 1.3659 1.6816 2.5025 2.1947 1.5306 1.8033 4.3286 1.2356 1.2349 3.4094 5.6894 1.7497 1.1285 1.6856 1.0469 1.0469 2.0485 2.2333 6.4130 6.6483 4.6483 7.0132 5.9498 1.0384 1.0385 1.0983 1.0983 1.0980 1.0975 1.0927 1.0931 1.0936 1.0767 1.0767 1.0642
irintensity: 0.0427 0.1039 3.1044 1.7831 6.4583 14.8914 6.6606 0.2550 3.2286 1.0654 0.9679 0.1202 3.6471 2.0648 0.7619 0.5371 5.6439 12.3603 3.4918 30.4852 13.7175 7.8370 1.1352 16.0994 44.5631 139.5917 34.2384 71.2528 0.0888 31.8320 0.6873 1.6041 61.7301 5.5983 3.4565 11.7863 48.4935 3.6798 16.6310 39.3436 2.0295 70.6163 7.2246 9.2644 129.0840 136.8823 101.4605 1.4788 36.1734 191.2445 23.3639 24.2141 144.3238 46.3222 42.4982 345.8399 176.3224 109.4396 10.2302 42.6378 21.3637 19.3157 288.2588 353.9391 238.1968 171.5641 115.2650 183.9691 37.7635 7.3268 7.2169 14.0138 13.8255 6.8593 9.2758 2.8339 16.2594 22.0242 14.4542 16.3673 48.0471
temp: 298.150 k
press: 1.00000 atm
elementType: 8 8 8 8 7 7 6 6 6 6 6 6 6 6 6 6 6 1 1 1 1 1 1 1 1 1 1 1 1
symmnumber: 1
zpe: 575304.4 jmol-1
zpe.correction: 0.219122 hartree
zpe.thermalcorrener: 0.234564 hartree
zpe.thermalcorrenthalpy: 0.235508 hartree
zpe.thermalcorrgfe: 0.174992 hartree
zpe.sumelectzpe: -835.584004 hartree
zpe.sumelectthermal: -835.568562 hartree
zpe.sumelectthermalent: -835.567618 hartree
zpe.sumelectthermalfe: -835.628133 hartree
dipole: -3.1810 -1.4338 0.0170
dipole: 3.4893
quadrupole: -89.7705 -94.8998 -100.4918
quadrupole: -9.7081 -0.0351 -0.0328
quadrupole: 5.2835 0.1542 -5.4377 -9.7081 -0.0351 -0.0328
hfenergy: -835.8031255 hartree
pointgroup: C01 [X(C11H12N2O4)]
dipole: 1.2835451 0.4868482 0.0061007 debye
polarizability: 216.3258569|-2.0260864|192.2035432|-0.0104178|-0.0476066|69.257555 unknown
InChI: InChI=1S/C11H12N2O4/c1-6(14)12-9-3-8(11(16)17)4-10(5-9)13-7(2)15/h3-5,12-13,16H,1-2H3
charge 0 multiplicity 1
29 atoms
O  -2.622296 -2.953134 0.001176
O  -0.595529 -4.080689 0.001639
O  3.344625 1.991503 -0.005091
O  -3.677712 1.344569 -0.000348
N  2.875821 -0.309026 -0.003697
N  -1.431936 2.031909 -0.004294
C  1.452236 -0.319519 -0.0028
C  -0.737348 0.79106 -0.002975
C  0.680207 0.866303 -0.003958
C  -0.605722 -1.636786 0.000272
C  0.805357 -1.578582 -0.000727
C  -1.397268 -0.463382 -0.000895
C  -1.224374 -2.99261 0.002622
C  3.741813 0.788656 -0.00451
C  -2.812767 2.265889 -0.002581
C  5.221078 0.407013 0.002048
C  -3.18051 3.749941 0.002443
H  1.200371 1.828356 -0.005793
H  1.369269 -2.518672 0.000214
H  -2.485586 -0.519239 -0.000346
H  3.31565 -1.23257 -0.002616
H  -0.834407 2.862398 -0.005769
H  5.485045 -0.154555 0.917295
H  5.820742 1.327426 -0.031566
H  5.480559 -0.219011 -0.871587
H  -2.807817 4.251008 0.915036
H  -4.275546 3.839095 -0.026759
H  -2.75669 4.273798 -0.874227
H  -2.972165 -3.884251 0.000993
