program: Gaussian 09
title: 000049378
version: EM64L-G09RevD.01
frameworkgroup: C1[X(C13H18O3)]
method: RPBEPBE
basis: SDD
operation: Freq
keyword: #pfreq=noraman
keyword: PBEPBE/SDD
title: #p freq=noraman PBEPBE/SDD
converged: YES YES NO NO
title: Mulliken charges:
elementType: O O O C C C C C C C C C C C C C H H H H H H H H H H H H H H H H H H
charge: -0.222354 -0.428835 -0.474301 -0.137208 -0.052643 -0.412822 0.070089 -0.719504 -0.733339 -0.706363 0.367128 -0.476021 -0.381179 0.177088 -0.351338 0.148150 0.187554 0.233002 0.214357 0.227494 0.238866 0.197582 0.214257 0.216054 0.225897 0.204018 0.235405 0.201332 0.217379 0.304540 0.228920 0.224541 0.384730 0.377524
chargesum: 0.00000
title: Mulliken charges with hydrogens summed into heavy atoms:
elementType: O O O C C C C C C C C C C C C C
charge: -0.222354 -0.044105 -0.096777 0.050346 0.180359 0.029030 0.070089 -0.068799 -0.087371 -0.052246 0.367128 -0.171481 -0.152259 0.177088 -0.126797 0.148150
polarizability: 2.16291513e+02 -5.62906737e+00 1.11088752e+02 -6.91312181e+00 9.12680662e+00 1.41653859e+02
1716.lowfreq: -9.4934 -0.0008 -0.0006 0.0001 6.2735 7.7877 15.5862 21.0711 53.8750
frequency: 14.0973 20.8863 53.8160 73.1684 106.4755 117.9425 152.9166 170.7572 203.3618 205.5080 212.0061 229.7416 266.7412 288.1755 293.2997 312.2325 325.4562 333.7940 372.9936 396.2911 421.8632 436.7326 441.1701 478.0154 517.7076 564.4664 573.3126 609.3029 700.0254 713.5111 739.5676 756.6290 789.6962 808.8988 833.7900 870.9605 903.8537 917.2157 919.6053 929.5675 943.9064 959.9366 1010.0489 1031.2556 1070.5138 1083.3249 1091.0982 1123.2543 1147.1803 1150.5633 1168.8315 1171.6639 1185.4988 1241.7139 1245.1510 1263.4282 1273.5371 1298.6241 1307.9123 1317.6638 1326.6749 1342.2174 1376.7155 1387.1163 1392.6953 1407.5023 1457.5748 1460.8600 1465.7646 1474.2178 1476.2238 1479.8435 1482.6973 1489.7253 1501.2366 1558.0053 1600.6355 1624.3418 2966.7543 2969.6897 2972.8898 2985.4572 2992.0143 3005.2250 3046.4766 3055.1208 3063.7856 3069.4419 3073.9767 3077.8281 3081.0818 3124.5716 3172.6055 3176.1520 3529.8967 3617.4111
redmass: 3.9112 4.8044 2.4904 2.1125 7.3064 3.5721 2.8620 3.1299 1.6264 3.1138 1.3022 1.1399 2.9165 4.5220 2.7683 1.3180 2.9272 2.6494 5.5281 3.2254 2.5599 2.8793 3.0191 1.1117 4.7028 5.4864 4.5692 6.4146 2.8271 2.7681 3.6924 5.0677 1.6062 2.2896 1.6903 3.0611 2.2492 1.2925 1.3198 1.4739 1.7295 1.4897 2.2386 1.9828 1.9225 2.0670 2.0984 2.0454 1.6317 1.5799 1.8387 1.9766 1.5734 1.4695 2.2161 1.4552 1.8622 1.6654 1.4107 1.3804 1.3575 1.5261 1.2108 1.2110 1.2073 6.3209 1.1227 2.6029 1.0850 1.0462 1.0481 1.0550 1.0543 1.0486 3.3621 8.0562 7.0312 6.9303 1.0365 1.0382 1.0361 1.0805 1.0605 1.0833 1.1001 1.0986 1.0979 1.0996 1.0996 1.1000 1.0987 1.0900 1.0915 1.0931 1.0649 1.0666
irintensity: 2.2731 0.1763 0.1166 0.3201 0.0186 0.6728 1.4484 2.3909 0.1170 0.8120 0.8690 0.0637 0.2533 6.2465 3.5178 132.6359 42.9550 2.1790 4.2150 3.9316 0.1497 10.6612 9.1682 136.7581 2.8014 19.8477 0.1600 21.7749 8.5484 1.2905 15.8644 50.8639 35.8711 11.0361 6.7260 11.9856 10.1708 1.7801 2.5572 14.0240 9.5981 2.6029 4.3207 1.6761 111.8673 172.5978 3.8629 4.3969 16.5588 3.7177 22.8652 41.5480 44.4658 61.1443 304.7130 20.1163 170.1988 27.7950 20.8094 2.4576 8.9382 75.1411 17.8345 6.7199 17.2780 5.6757 8.2827 25.9089 1.9978 1.3022 17.0213 10.3897 14.2404 31.3925 110.4756 128.9491 35.6734 26.5437 29.7973 30.3746 28.2179 0.5564 27.4170 25.7590 1.9251 2.5322 71.1900 72.3004 29.1683 66.8229 50.3444 15.9178 7.7581 6.2517 87.2923 82.8870
temp: 298.150 k
press: 1.00000 atm
elementType: 8 8 8 6 6 6 6 6 6 6 6 6 6 6 6 6 1 1 1 1 1 1 1 1 1 1 1 1 1 1 1 1 1 1
symmnumber: 1
zpe: 738365.6 jmol-1
zpe.correction: 0.281229 hartree
zpe.thermalcorrener: 0.298719 hartree
zpe.thermalcorrenthalpy: 0.299664 hartree
zpe.thermalcorrgfe: 0.234673 hartree
zpe.sumelectzpe: -730.628145 hartree
zpe.sumelectthermal: -730.610655 hartree
zpe.sumelectthermalent: -730.609710 hartree
zpe.sumelectthermalfe: -730.674701 hartree
dipole: 1.7358 -1.5530 -5.5970
dipole: 6.0622
quadrupole: -81.4234 -98.6814 -96.6994
quadrupole: -2.9975 -9.8290 0.1941
quadrupole: 10.8446 -6.4133 -4.4314 -2.9975 -9.8290 0.1941
hfenergy: -730.9093741 hartree
pointgroup: C01 [X(C13H18O3)]
dipole: 0.6961052 1.4296385 1.7776728 debye
polarizability: 215.6504546|12.3053827|122.7306522|0.2026492|16.9267279|130.6530175 unknown
InChI: InChI=1S/C13H18O3/c1-4-10(8(2)3)13(16)9-5-6-11(14)12(15)7-9/h5-8,10,14-15H,4H2,1-3H3
charge 0 multiplicity 1
34 atoms
O  -1.123007 -1.337225 -1.432414
O  3.868519 -0.600504 -1.512075
O  4.481688 0.976202 0.58911
C  -2.165806 -0.125019 0.381019
C  -3.121605 0.700305 -0.552247
C  -2.846939 -1.393743 0.975634
C  -0.938619 -0.567208 -0.438281
C  -2.405547 1.956372 -1.108459
C  -4.4271 1.115683 0.165728
C  -1.927912 -2.206961 1.914227
C  0.451935 -0.11455 -0.093372
C  1.511526 -0.553847 -0.938156
C  0.751646 0.717804 1.018881
C  2.832876 -0.170748 -0.679926
C  2.082975 1.105548 1.286755
C  3.115984 0.663472 0.440152
H  -1.865579 0.533041 1.219336
H  -3.376632 0.038499 -1.40489
H  -3.748999 -1.083433 1.534177
H  -3.180096 -2.031539 0.134349
H  -1.497418 1.695259 -1.680938
H  -2.107234 2.638025 -0.287425
H  -3.077295 2.518249 -1.783294
H  -5.034721 1.761261 -0.495721
H  -5.05058 0.24828 0.443832
H  -4.209279 1.691979 1.086719
H  -1.052518 -2.61013 1.373511
H  -1.552747 -1.583987 2.748992
H  -2.473464 -3.06288 2.351867
H  1.28036 -1.19504 -1.793588
H  -0.040709 1.069166 1.684112
H  2.309759 1.746873 2.147583
H  4.728848 -0.231245 -1.179873
H  4.651293 1.554744 1.370673
