program: Gaussian 09
title: 000049248
version: EM64L-G09RevD.01
frameworkgroup: C1[X(C11H16N2O3)]
method: RPBEPBE
basis: SDD
operation: Freq
keyword: #p
keyword: freq=noraman
keyword: PBEPBE/SDD
title: #p freq=noraman PBEPBE/SDD
converged: YES YES NO NO
title: Mulliken charges:
elementType: O O O N N C C C C C C C C C C C H H H H H H H H H H H H H H H H
charge: -0.219459 -0.214361 -0.220499 -0.371799 -0.365256 0.072836 -0.399376 -0.287903 0.123726 0.141864 -0.707024 -0.132114 -0.449471 0.161754 -0.348556 -0.686410 0.247207 0.237042 0.280290 0.227733 0.228250 0.229473 0.251983 0.207344 0.199407 0.367053 0.367006 0.203034 0.213298 0.221301 0.212252 0.209377
chargesum: 0.00000
title: Mulliken charges with hydrogens summed into heavy atoms:
elementType: O O O N N C C C C C C C C C C C
charge: -0.219459 -0.214361 -0.220499 -0.004746 0.001750 0.072836 0.084873 -0.007613 0.123726 0.141864 -0.021569 0.119869 -0.042720 0.161754 0.067776 -0.043481
polarizability: 1.70415334e+02 -7.75815170e+00 1.34955386e+02 -8.72053979e+00 -5.87303728e+00 1.24726459e+02
1716.lowfreq: -7.9701 -0.0004 0.0004 0.0006 4.5436 10.4071 17.3609 37.6771 59.1494
frequency: 17.0497 37.4744 59.0913 64.0745 85.0876 94.3634 128.8751 143.8235 157.2291 175.9809 198.6170 224.5994 244.4189 251.8490 292.0507 321.4631 357.0032 360.7422 376.5072 427.9752 438.0698 481.1882 528.5712 591.2234 632.7285 660.2421 685.1534 707.9602 733.2861 753.7120 755.3463 773.9936 793.0318 804.7246 876.1167 892.9326 935.6408 951.2819 980.5334 992.8924 1005.6401 1036.9937 1064.1229 1076.2506 1094.0432 1115.9371 1122.8227 1154.5120 1206.2907 1225.0982 1259.1946 1275.2350 1287.3047 1296.7394 1312.4629 1316.0027 1338.3701 1342.0460 1368.0356 1376.5693 1377.6903 1391.1046 1392.5752 1450.6194 1458.2541 1473.4199 1478.0697 1478.6573 1484.6567 1485.4456 1614.7400 1647.3305 1667.2297 1678.0475 2957.0015 2974.3360 2980.8499 2982.2399 3015.1447 3022.8417 3039.9273 3067.8423 3072.3659 3075.8196 3082.0204 3095.1352 3096.3103 3103.0640 3517.8347 3519.5792
redmass: 5.5006 2.8918 3.9610 2.3711 2.4435 2.4187 3.6707 5.7942 10.1717 5.4342 1.3170 1.2833 1.7677 2.9383 1.9503 3.6335 8.6356 5.4153 6.4795 3.5146 4.7856 9.4513 4.0836 7.5562 3.8120 2.4694 2.5992 5.1891 1.3332 1.8661 1.6296 1.6846 1.9200 1.7011 1.4099 1.7788 2.4639 2.2218 1.1764 3.2674 1.9733 3.2980 2.2089 3.7226 2.0326 2.8114 1.9299 2.7764 2.5605 1.6018 1.2854 1.1848 1.1894 2.4833 1.4177 1.2535 1.5816 1.5720 7.7967 1.6331 1.9186 1.2112 1.2110 1.0864 1.0871 1.0593 1.0426 1.0500 1.0415 1.0767 6.8700 8.2306 6.6350 5.4961 1.0614 1.0356 1.0610 1.0360 1.0964 1.0602 1.1020 1.1007 1.1012 1.0992 1.0981 1.0977 1.1015 1.0862 1.0758 1.0781
irintensity: 0.3433 0.7803 0.3941 0.0013 0.3548 0.0735 0.4708 1.0052 11.3891 1.3210 0.4478 0.3149 0.7530 0.6684 1.3343 3.4584 18.9801 9.7646 8.1488 1.4214 22.8924 16.9396 9.2329 2.2117 4.6871 2.6426 28.1601 6.5083 3.7176 15.9398 4.6414 24.5213 191.4854 4.2647 0.7913 5.9589 4.0807 13.5720 30.1447 0.1478 15.9347 9.4458 7.8508 29.0540 7.4505 1.1240 0.3108 2.9531 27.4282 12.1861 8.5573 9.6050 17.7982 245.4666 30.1681 2.4745 51.3288 45.5859 207.8423 2.5426 8.7078 10.9036 13.1117 26.1475 5.2878 3.6702 12.3988 7.7712 16.7264 15.8082 290.5309 73.3518 16.0919 611.7311 19.3874 47.4736 31.4200 24.3589 4.9026 10.9142 15.7522 8.0492 74.3677 45.4423 34.4233 10.7967 8.4490 18.4761 83.3377 44.3992
temp: 298.150 k
press: 1.00000 atm
elementType: 8 8 8 7 7 6 6 6 6 6 6 6 6 6 6 6 1 1 1 1 1 1 1 1 1 1 1 1 1 1 1 1
symmnumber: 1
zpe: 681516.9 jmol-1
zpe.correction: 0.259576 hartree
zpe.thermalcorrener: 0.276700 hartree
zpe.thermalcorrenthalpy: 0.277644 hartree
zpe.thermalcorrgfe: 0.213053 hartree
zpe.sumelectzpe: -762.757684 hartree
zpe.sumelectthermal: -762.740561 hartree
zpe.sumelectthermalent: -762.739616 hartree
zpe.sumelectthermalfe: -762.804207 hartree
dipole: -1.6681 0.2705 0.0451
dipole: 1.6905
quadrupole: -94.8307 -100.1220 -102.8207
quadrupole: 6.3524 2.8903 1.3852
quadrupole: 4.4271 -0.8642 -3.5629 6.3524 2.8903 1.3852
hfenergy: -763.0172602 hartree
pointgroup: C01 [X(C11H16N2O3)]
dipole: -0.6366453 0.1690986 0.0919426 debye
polarizability: 166.6253694|-9.7367764|138.2379804|-14.1055609|-1.9598659|125.2338292 unknown
InChI: InChI=1S/C11H16N2O3/c1-3-5-6-7-11(4-2)8(14)12-10(16)13-9(11)15/h6-7,12-13H,3-5H2,1-2H3
charge 0 multiplicity 1
32 atoms
O  0.537141 -0.455339 2.181424
O  1.566856 1.302551 -2.229742
O  3.073871 -2.874472 -0.861132
N  1.742395 -1.641507 0.613246
N  2.272826 -0.778852 -1.519968
C  0.68964 0.539276 -0.06318
C  0.893722 1.967099 0.553794
C  -0.773409 0.411457 -0.55087
C  0.979198 -0.524875 1.005432
C  1.546617 0.41212 -1.342144
C  2.344489 2.268833 0.982553
C  -1.779782 -0.270955 0.050521
C  -3.205358 -0.297561 -0.456411
C  2.404794 -1.842224 -0.610357
C  -4.219853 0.258092 0.581154
C  -5.678322 0.156691 0.086361
H  0.213652 2.03576 1.420631
H  0.561971 2.700202 -0.202663
H  -0.964239 0.987671 -1.467837
H  2.406022 3.285062 1.410644
H  2.696586 1.563501 1.757616
H  3.04014 2.23016 0.12435
H  -1.589955 -0.822633 0.983107
H  -3.288749 0.274517 -1.400926
H  -3.489999 -1.345584 -0.690575
H  1.871425 -2.38129 1.311694
H  2.778859 -0.887018 -2.405282
H  -4.10828 -0.29747 1.533745
H  -3.967682 1.313239 0.802991
H  -6.384418 0.56112 0.834117
H  -5.820226 0.723162 -0.853197
H  -5.959231 -0.895336 -0.110096
