program: Gaussian 09
title: 000049194
version: EM64L-G09RevD.01
frameworkgroup: C1[X(C12H18N2O3)]
method: RPBEPBE
basis: SDD
operation: Freq
keyword: #p
keyword: freq=noraman
keyword: PBEPBE/SDD
title: #p freq=noraman PBEPBE/SDD
converged: YES YES NO NO
title: Mulliken charges:
elementType: O O O N N C C C C C C C C C C C C H H H H H H H H H H H H H H H H H H
charge: -0.204065 -0.212085 -0.221961 -0.379269 -0.378445 0.087071 -0.180889 -0.456036 -0.372395 0.181999 0.145276 -0.737870 -0.358791 -0.032096 0.137886 -0.701410 -0.608863 0.235090 0.221596 0.228352 0.206079 0.219348 0.259805 0.233048 0.229960 0.199080 0.198028 0.245510 0.363659 0.364356 0.213306 0.212589 0.217187 0.224943 0.220008
chargesum: 0.00000
title: Mulliken charges with hydrogens summed into heavy atoms:
elementType: O O O N N C C C C C C C C C C C C
charge: -0.204065 -0.212085 -0.221961 -0.015611 -0.014090 0.087071 0.047463 0.000650 0.053032 0.181999 0.145276 -0.015057 0.038317 0.213414 0.137886 -0.058328 -0.163912
polarizability: 1.65597383e+02 8.93733689e+00 1.47929541e+02 1.16261691e+01 -6.82627540e+00 1.39369597e+02
1716.lowfreq: -11.0100 -0.0006 -0.0004 0.0005 8.3400 8.8796 38.3864 46.8404 54.4805
frequency: 38.3461 46.7597 54.4325 68.1742 76.8588 97.1799 138.0580 147.5363 154.7871 157.6795 183.5650 220.7775 225.3706 245.2071 250.3589 280.8620 305.6754 323.1419 345.2419 361.9211 371.3181 414.7692 479.7897 486.6961 543.4254 611.2156 623.5681 643.1452 653.7189 688.6975 702.1100 732.4885 748.9061 752.4088 774.5899 777.9157 862.1551 885.9392 888.1907 924.5938 949.3288 972.0163 983.0736 989.9523 998.8021 1015.3674 1049.6490 1067.2340 1084.9960 1112.0857 1131.0844 1148.8197 1177.7886 1197.3846 1233.8895 1267.2055 1282.2622 1291.4834 1295.0887 1300.4980 1310.7318 1317.5018 1335.7517 1359.3723 1362.2706 1373.3296 1374.6883 1389.9555 1394.0147 1428.7789 1447.4335 1467.7044 1473.5328 1475.8128 1476.7777 1486.6986 1487.3990 1614.8843 1651.3548 1651.8198 1674.8737 2964.9693 2973.8215 2977.6691 2984.2505 2992.4497 3008.5238 3013.5078 3038.5543 3070.1855 3073.1338 3080.8686 3086.3615 3090.1205 3095.9616 3106.9847 3198.0978 3520.5011 3522.4952
redmass: 5.5626 3.9182 4.0495 1.5386 3.0438 3.8429 2.8315 3.6443 6.4666 8.0414 4.1741 1.9823 1.3954 1.3421 2.1768 2.5338 3.0364 2.6617 2.5822 8.2789 9.0934 2.9355 5.4382 8.8241 4.8202 4.9063 3.8577 2.4165 2.3288 2.7208 2.7654 1.1245 1.8247 4.6105 1.3219 1.6721 2.4525 2.1850 1.5621 2.6591 1.3206 1.2724 1.6376 3.5384 1.1768 2.7410 1.9172 3.1216 2.4070 2.7327 2.7038 2.5431 2.9079 2.9911 1.4680 1.2985 1.3040 1.2663 1.1447 3.0703 1.2646 1.2513 1.3908 1.5309 8.2418 1.8167 1.6460 1.2141 1.1933 1.1902 1.0818 1.0690 1.0495 1.0556 1.0504 1.0515 1.0805 7.0285 8.5081 4.6975 5.5899 1.0583 1.0377 1.0583 1.0833 1.0357 1.0991 1.0594 1.1024 1.1009 1.0993 1.1020 1.0618 1.0994 1.1005 1.0933 1.1140 1.0760 1.0781
irintensity: 0.3408 0.0146 0.0945 0.0031 0.2422 0.6063 0.0166 0.7906 3.3526 8.4151 0.9401 0.7485 0.5325 1.3937 1.4515 1.6727 1.1931 1.6110 5.1357 20.1221 6.9570 0.8502 23.0402 15.3253 10.3120 5.7052 4.7646 4.8936 4.6704 29.3165 13.8445 5.9728 9.2825 4.6482 2.0152 190.1878 8.4803 9.1747 1.4560 19.3951 67.3101 6.7772 0.7930 3.8231 5.5299 15.7505 33.1733 8.3836 0.2723 29.8276 33.9112 7.3855 12.3847 16.2356 10.0098 7.8241 19.3173 8.9435 4.0958 246.5270 15.1467 14.4634 12.6248 2.8760 213.2614 6.1300 9.9827 13.5540 17.8699 10.9763 16.5008 0.0455 11.0961 6.1363 13.1696 6.8505 12.6716 279.3675 105.2575 15.2456 591.9290 18.0459 29.1049 41.7059 16.8773 15.0940 4.6140 25.1374 11.7853 48.5664 51.5805 34.8366 9.0194 23.5907 11.3949 8.1458 18.9641 84.3605 43.6364
temp: 298.150 k
press: 1.00000 atm
elementType: 8 8 8 7 7 6 6 6 6 6 6 6 6 6 6 6 6 1 1 1 1 1 1 1 1 1 1 1 1 1 1 1 1 1 1
symmnumber: 1
zpe: 754776.2 jmol-1
zpe.correction: 0.287479 hartree
zpe.thermalcorrener: 0.305732 hartree
zpe.thermalcorrenthalpy: 0.306676 hartree
zpe.thermalcorrgfe: 0.240937 hartree
zpe.sumelectzpe: -801.973709 hartree
zpe.sumelectthermal: -801.955456 hartree
zpe.sumelectthermalent: -801.954512 hartree
zpe.sumelectthermalfe: -802.020252 hartree
dipole: -0.1893 1.6785 0.4962
dipole: 1.7606
quadrupole: -104.2488 -105.0115 -109.3092
quadrupole: -5.7228 -1.8495 0.8734
quadrupole: 1.9410 1.1784 -3.1194 -5.7228 -1.8495 0.8734
hfenergy: -802.2611883 hartree
pointgroup: C01 [X(C12H18N2O3)]
dipole: -0.0055118 0.6429971 -0.2574805 debye
polarizability: 166.5259839|-5.5025481|147.3142809|12.5449403|7.3641154|139.0562562 unknown
InChI: InChI=1S/C12H18N2O3/c1-4-6-7-12(8(3)5-2)9(15)13-11(17)14-10(12)16/h5,8,13-14H,2,4,6-7H2,1,3H3
charge 0 multiplicity 1
35 atoms
O  -0.163979 0.583662 2.223919
O  -0.186996 -1.139526 -2.237429
O  3.079618 -2.422055 0.807394
N  1.517914 -0.805658 1.460315
N  1.474288 -1.689072 -0.728353
C  0.006571 0.273654 -0.219214
C  0.938408 1.505754 -0.722983
C  -1.506285 0.597757 -0.328633
C  -2.439197 -0.527717 0.175213
C  0.399269 0.029983 1.247976
C  0.374704 -0.904366 -1.136441
C  0.513351 2.016817 -2.124637
C  -3.92993 -0.159578 -0.003249
C  0.948722 2.652235 0.272443
C  2.103332 -1.681854 0.531054
C  -4.881554 -1.266257 0.498969
C  2.074883 3.171476 0.819374
H  -1.736203 0.799668 -1.389186
H  -1.707847 1.518047 0.249702
H  1.971933 1.109294 -0.793463
H  -2.232812 -1.462769 -0.383583
H  -2.243741 -0.728386 1.24649
H  0.385345 1.192316 -2.846867
H  1.291627 2.701779 -2.504125
H  -0.432196 2.584142 -2.075596
H  -4.129309 0.043734 -1.07512
H  -4.139363 0.784242 0.540554
H  -0.026642 3.096827 0.51624
H  1.885243 -0.858159 2.416065
H  1.814739 -2.394578 -1.389858
H  -4.721039 -1.468488 1.574655
H  -4.714147 -2.212314 -0.049586
H  -5.940686 -0.980351 0.363262
H  2.037488 4.027995 1.501001
H  3.067692 2.757245 0.600496
