program: Gaussian 09
title: 000049217
version: EM64L-G09RevD.01
frameworkgroup: C1[X(C12H20N2O3S)]
method: RPBEPBE
basis: SDD
operation: Freq
keyword: #p
keyword: freq=noraman
keyword: PBEPBE/SDD
title: #p freq=noraman PBEPBE/SDD
converged: YES YES NO NO
title: Mulliken charges:
elementType: S O O O N N C C C C C C C C C C C C H H H H H H H H H H H H H H H H H H H H
charge: 0.186402 -0.184115 -0.202358 -0.220276 -0.392414 -0.374441 0.137014 -0.457599 -0.394187 0.181050 0.145376 -0.666431 -0.730575 -0.688943 -0.312039 0.137719 -0.330750 -0.681167 0.270114 0.224914 0.239982 0.242138 0.230672 0.242945 0.235119 0.242086 0.221079 0.252872 0.255775 0.363349 0.364596 0.198347 0.205869 0.190419 0.242627 0.224735 0.209014 0.191083
chargesum: 0.00000
title: Mulliken charges with hydrogens summed into heavy atoms:
elementType: S O O O N N C C C C C C C C C C C C
charge: 0.186402 -0.184115 -0.202358 -0.220276 -0.029066 -0.009845 0.137014 -0.187485 0.070709 0.181050 0.145376 0.049324 -0.032291 -0.180295 0.092177 0.137719 0.102296 -0.056335
polarizability: 1.90399259e+02 -7.81871332e+00 1.69591583e+02 -5.55628492e+00 -8.99487138e+00 1.46370616e+02
1716.lowfreq: -12.6655 -7.7897 -0.0015 -0.0013 0.0009 6.9507 12.4446 26.9656 43.4760
frequency: -6.1386 26.7088 43.4274 56.3053 75.7122 110.0590 113.9546 123.3574 146.7359 150.0150 161.2773 169.3132 192.6908 211.3178 218.7979 234.7304 240.5438 265.3916 298.4512 301.8374 317.9118 357.8335 359.6723 363.4118 448.6603 460.4442 485.4620 517.0520 595.0393 604.4221 610.5799 621.5013 643.4212 680.9613 697.2945 718.6943 738.4788 745.5444 767.4949 775.4356 792.0722 868.1803 906.3000 913.7441 928.7061 951.2056 991.2367 1001.4183 1011.0058 1060.8015 1061.6732 1070.3451 1076.5257 1100.0088 1106.5523 1129.2646 1141.4377 1179.7148 1198.4226 1216.9851 1231.3451 1274.4582 1287.1227 1292.1860 1296.0650 1304.7630 1308.0283 1334.8691 1356.1105 1360.1037 1372.6009 1375.5581 1388.3011 1398.0415 1400.7196 1436.0859 1451.2024 1455.9950 1462.2038 1472.4719 1473.2151 1476.5447 1486.4329 1488.9958 1489.5705 1620.2221 1656.3996 1673.2729 2953.7085 2968.4976 2975.9416 2992.2398 2994.5461 2998.7453 3011.5508 3017.1131 3020.2544 3034.2270 3062.5292 3072.9014 3077.3705 3079.0889 3084.0613 3085.0652 3100.5173 3107.7488 3515.8855 3520.5116
redmass: 4.6855 4.2901 3.5463 5.5943 1.8731 2.5014 2.2558 3.2998 4.6150 4.9422 6.2408 5.9419 2.3200 2.1975 1.2611 1.5143 2.0104 2.0624 2.2695 2.4533 3.3208 6.0071 5.8431 8.4868 4.7905 2.7998 9.1928 4.4542 6.0380 4.8725 3.7049 3.6619 2.9088 2.3799 3.9824 3.6591 1.5120 1.5263 1.4244 1.7959 1.6554 1.3915 4.1587 1.4181 2.1581 1.8159 3.4120 1.7642 2.6113 1.7036 1.9030 1.9523 1.6314 2.8377 2.0756 2.4452 2.7220 4.1589 1.3960 1.3400 1.3166 1.2967 2.1505 1.2667 1.2097 1.4806 1.2644 1.3938 8.8027 1.5623 1.8354 1.5350 1.2171 1.2000 1.1971 1.0893 1.0770 1.0823 1.0479 1.0471 1.0422 1.0450 1.0506 1.0906 1.0419 7.2035 8.8617 5.5667 1.0597 1.0374 1.0642 1.0358 1.0366 1.0860 1.0680 1.0605 1.0836 1.0994 1.1005 1.1008 1.0992 1.1052 1.0987 1.0994 1.1020 1.0986 1.0765 1.0775
irintensity: 0.1392 0.0466 0.1832 0.4683 0.1854 0.5398 0.8500 0.9475 3.2369 1.2168 3.4687 3.3220 0.6575 0.5260 0.0611 0.2370 0.5995 0.3608 1.6590 1.3188 1.9555 21.0239 5.7870 6.8141 14.1553 2.0838 12.2601 9.2537 1.5821 1.8488 5.5032 9.3313 17.7548 43.5175 2.7503 7.9876 49.7869 1.1191 18.7322 178.4309 1.2360 5.8280 17.4240 7.6006 3.6708 9.8689 11.4992 6.7192 3.5664 24.8095 5.6008 2.6451 7.4053 16.3286 3.5862 33.2313 11.1655 17.0834 3.8282 8.0230 11.5126 32.2423 154.0007 45.6277 9.8881 30.2238 10.2174 11.1278 238.9805 2.7725 4.7248 5.6796 10.7376 13.7339 29.6503 11.3938 18.1690 2.4771 7.3355 11.2448 5.5856 6.2454 8.8520 18.6551 18.1865 281.4704 102.5836 547.2395 18.3283 34.0726 29.6816 30.7455 18.1250 16.0952 43.6996 11.6804 7.2678 3.0019 98.6484 1.2379 39.3663 16.8502 26.6664 20.5302 22.6569 16.4441 63.5815 57.6851
temp: 298.150 k
press: 1.00000 atm
elementType: 16 8 8 8 7 7 6 6 6 6 6 6 6 6 6 6 6 6 1 1 1 1 1 1 1 1 1 1 1 1 1 1 1 1 1 1 1 1
symmnumber: 1
zpe: 817354.1 jmol-1
zpe.correction: 0.311314 hartree
zpe.thermalcorrener: 0.330888 hartree
zpe.thermalcorrenthalpy: 0.331833 hartree
zpe.thermalcorrgfe: 0.263431 hartree
zpe.sumelectzpe: -1201.151530 hartree
zpe.sumelectthermal: -1201.131955 hartree
zpe.sumelectthermalent: -1201.131011 hartree
zpe.sumelectthermalfe: -1201.199413 hartree
dipole: -1.4358 -0.5064 -1.8265
dipole: 2.3778
quadrupole: -116.5331 -126.6413 -118.3197
quadrupole: 1.7250 4.3088 5.3072
quadrupole: 3.9649 -6.1433 2.1784 1.7250 4.3088 5.3072
hfenergy: -1201.4628437 hartree
pointgroup: C01 [X(C12H20N2O3S1)]
dipole: -0.7042602 0.1374468 0.6002563 debye
polarizability: 183.9688119|12.4247708|171.8553009|12.9329819|-7.0650653|150.5373462 unknown
InChI: InChI=1S/C12H20N2O3S/c1-4-6-7-18-8(3)12(5-2)9(15)13-11(17)14-10(12)16/h8,13-14H,4-7H2,1-3H3
charge 0 multiplicity 1
38 atoms
S  -1.632637 2.051924 -0.076742
O  -0.059734 -0.223676 -1.939591
O  2.968732 0.849975 1.54175
O  0.66428 -3.184153 1.557108
N  0.166856 -1.609039 -0.102158
N  1.724528 -1.098057 1.595311
C  0.952631 0.758624 0.102284
C  -0.226377 1.346529 1.01778
C  1.588268 1.849894 -0.797341
C  0.337028 -0.364731 -0.759861
C  1.988985 0.198387 1.101591
C  0.228639 2.424235 2.017816
C  2.745326 1.34711 -1.687359
C  -3.127283 1.294962 0.829351
C  -3.385669 -0.188189 0.509577
C  0.825931 -2.041757 1.060841
C  -3.711371 -0.468577 -0.973706
C  -3.997319 -1.96102 -1.244903
H  -0.686922 0.500434 1.562214
H  1.962066 2.657763 -0.144885
H  0.786269 2.264975 -1.4345
H  0.584853 3.329096 1.499189
H  -0.633706 2.720242 2.640397
H  1.033925 2.067797 2.685113
H  3.57947 0.953706 -1.079695
H  2.406683 0.565174 -2.388757
H  3.141981 2.183472 -2.290063
H  -3.972469 1.927493 0.502803
H  -2.973259 1.463536 1.910453
H  -0.380688 -2.322192 -0.59564
H  2.315028 -1.434287 2.363202
H  -2.51061 -0.797559 0.818497
H  -4.232215 -0.527735 1.144393
H  -4.59176 0.136386 -1.272803
H  -2.866295 -0.122701 -1.598421
H  -4.1968 -2.142304 -2.316388
H  -4.874766 -2.314563 -0.671083
H  -3.136501 -2.594175 -0.952375
