program: Gaussian 09
title: 000005012
version: EM64L-G09RevD.01
frameworkgroup: C1[X(C13H14N4O2)]
method: RPBEPBE
basis: SDD
operation: Freq
keyword: #p
keyword: freq=noraman
keyword: PBEPBE/SDD
title: #p freq=noraman PBEPBE/SDD
converged: YES YES NO NO
title: Mulliken charges:
elementType: O O N N N N C C C C C C C C C C C C C H H H H H H H H H H H H H H
charge: -0.222735 -0.226811 -0.161749 -0.294017 -0.094050 0.015064 -0.359447 -0.337946 -0.413138 -0.400678 0.223162 -0.313131 -0.092153 0.458504 -0.299354 -0.539025 -0.294253 0.375502 -0.378240 0.223277 0.274982 0.199984 0.234692 0.201249 0.222593 0.220922 0.194318 0.275694 0.220629 0.249142 0.288404 0.262256 0.286352
chargesum: 0.00000
title: Mulliken charges with hydrogens summed into heavy atoms:
elementType: O O N N N N C C C C C C C C C C C C C
charge: -0.222735 -0.226811 -0.161749 -0.018323 -0.094050 0.015064 0.138812 0.096729 0.010704 0.014562 0.223162 -0.092502 -0.092153 0.458504 -0.050212 -0.250621 -0.031996 0.375502 -0.091888
polarizability: 4.06532039e+02 1.11808925e+01 1.75763945e+02 -1.15707311e+01 3.13276704e+00 8.79910508e+01
1716.lowfreq: -0.0005 -0.0005 0.0002 4.6147 7.8116 13.8599 29.5953 48.3209 59.9640
frequency: 28.8496 47.7264 59.9356 68.9096 106.5158 148.7648 182.0149 186.7685 227.8379 261.8824 280.7963 326.1974 354.6169 376.2580 400.2292 418.7817 442.3620 475.0579 481.2137 489.0624 527.6028 536.3201 537.1511 572.9389 630.1246 658.5455 666.5619 675.1740 710.4006 747.5176 787.0724 788.8104 808.4191 837.2778 853.7057 854.5446 884.1320 915.8727 928.7333 932.9474 965.8883 977.8293 996.1861 1040.3766 1048.1880 1057.2466 1075.6118 1100.4009 1123.9230 1144.8358 1152.5307 1167.6058 1196.6246 1202.9915 1231.1898 1238.1155 1248.9942 1259.4323 1283.9178 1309.0935 1322.5481 1330.1835 1349.0618 1352.4180 1371.0543 1383.9284 1394.9905 1421.3356 1428.7689 1442.5088 1454.5710 1458.7116 1460.2281 1470.4390 1481.1466 1516.7033 1549.0457 1608.2892 1625.5725 2872.9710 2885.9577 2981.4077 2985.5292 3044.1122 3050.4577 3108.9375 3111.8511 3137.1157 3160.9639 3163.2049 3179.6812 3186.8801 3472.4622
redmass: 5.1542 3.7857 5.5842 8.0644 5.4919 5.1834 4.9605 5.0079 3.2509 2.9271 3.6227 4.6631 4.0140 4.3080 3.2062 2.6026 2.8901 3.2047 3.4646 2.5005 7.0142 4.5540 3.9443 2.8342 7.7511 2.4426 2.3342 4.7485 5.3789 8.8539 5.1758 3.2229 1.6224 1.5460 1.8142 4.0640 3.7129 2.3816 4.2870 1.4469 3.0006 1.4069 1.3222 2.3117 1.7513 1.9546 2.1704 2.1767 1.6471 2.2367 1.5335 2.5655 1.1084 5.0291 1.6664 1.4936 1.7453 1.5582 1.3186 2.0562 1.3816 1.2558 2.5700 2.3721 3.3335 1.4971 2.7425 3.4905 8.0425 1.3379 1.0869 1.1713 1.1584 1.1107 2.8973 4.0216 8.0973 6.9208 7.3302 1.0706 1.0699 1.0686 1.0674 1.0901 1.0913 1.0952 1.0929 1.0902 1.0921 1.0890 1.0942 1.0968 1.0756
irintensity: 0.1453 0.1812 0.7935 0.0781 0.7489 1.2942 0.7833 9.6365 1.3085 4.2313 4.9306 2.0625 0.6193 10.4690 0.8077 2.1803 1.9449 5.9977 31.6534 56.5314 3.1344 0.8397 0.7646 82.4151 2.7184 41.3692 50.7863 4.3123 11.2232 4.6750 0.3211 2.3114 35.0893 1.4823 33.2518 17.3537 21.8321 1.7266 0.6199 26.3820 58.9147 8.8439 0.2382 42.2154 6.6538 11.1004 16.4326 15.0948 9.1318 18.8822 72.7688 13.5060 3.1111 898.6158 163.9132 14.2343 109.6992 16.5134 26.4732 21.0712 41.1287 2.4715 88.0613 48.3117 44.5268 2.3943 23.3881 43.6898 66.8857 8.5633 12.2255 46.8885 45.2683 4.0635 42.9634 331.7186 47.8750 113.9732 429.9607 76.3016 85.1755 38.8398 97.8162 60.4749 60.0610 9.7955 17.4037 3.4418 0.4154 3.1756 19.7653 2.4016 0.0943
temp: 298.150 k
press: 1.00000 atm
elementType: 8 8 7 7 7 7 6 6 6 6 6 6 6 6 6 6 6 6 6 1 1 1 1 1 1 1 1 1 1 1 1 1 1
symmnumber: 1
zpe: 680685.0 jmol-1
zpe.correction: 0.259259 hartree
zpe.thermalcorrener: 0.274785 hartree
zpe.thermalcorrenthalpy: 0.275730 hartree
zpe.thermalcorrgfe: 0.215362 hartree
zpe.sumelectzpe: -871.784762 hartree
zpe.sumelectthermal: -871.769236 hartree
zpe.sumelectthermalent: -871.768292 hartree
zpe.sumelectthermalfe: -871.828660 hartree
dipole: 10.0984 1.4569 0.5572
dipole: 10.2182
quadrupole: -137.3611 -100.0868 -111.8605
quadrupole: 2.7175 8.1523 -0.8147
quadrupole: -20.9249 16.3493 4.5757 2.7175 8.1523 -0.8147
hfenergy: -872.0440214 hartree
pointgroup: C01 [X(C13H14N4O2)]
dipole: -3.9696165 0.6324685 0.0606462 debye
polarizability: 404.6392602|-10.0300103|174.1376005|-26.9880885|13.2710618|91.510174 unknown
InChI: InChI=1S/C13H14N4O2/c18-17(19)11-2-3-12-10(9-11)1-4-13(15-12)16-7-5-14-6-8-16/h1-4,9,14H,5-8H2
charge 0 multiplicity 1
33 atoms
O  5.578938 -1.105535 -0.665295
O  5.377896 1.148828 -0.355549
N  -2.903181 0.076608 0.509038
N  -5.584819 -0.412547 -0.325388
N  -0.730345 -0.725961 0.151987
N  4.872567 -0.041821 -0.443963
C  -3.423488 -1.3113 0.439399
C  -3.954832 1.086954 0.745168
C  -4.534409 -1.410584 -0.626174
C  -5.061486 0.967309 -0.329767
C  -1.547843 0.341571 0.384881
C  -1.015018 1.690833 0.50231
C  0.621727 -0.52278 0.016313
C  1.231869 0.791722 0.108749
C  0.347712 1.897238 0.363267
C  2.634252 0.939127 -0.044377
C  1.469526 -1.65642 -0.228446
C  3.418638 -0.197351 -0.284224
C  2.845395 -1.503611 -0.377431
H  -3.848488 -1.580887 1.427003
H  -2.578498 -1.976012 0.209058
H  -3.538244 2.104086 0.731405
H  -4.410271 0.907242 1.739899
H  -4.072652 -1.26519 -1.633204
H  -4.976287 -2.422514 -0.592052
H  -5.879394 1.668754 -0.083894
H  -4.62613 1.269332 -1.314827
H  -6.429652 -0.526333 -0.89759
H  -1.667875 2.541715 0.706336
H  0.762512 2.907909 0.451196
H  3.115251 1.920164 0.021002
H  0.995804 -2.640071 -0.293101
H  3.505624 -2.354376 -0.564231
