program: Gaussian 09
title: 000049099
version: EM64L-G09RevD.01
frameworkgroup: C1[X(C4H7Cl2NO2)]
method: RPBEPBE
basis: SDD
operation: Freq
keyword: #p
keyword: freq=noraman
keyword: PBEPBE/SDD
title: #p freq=noraman PBEPBE/SDD
converged: YES YES NO NO
title: Mulliken charges:
elementType: Cl Cl O O N C C C C H H H H H H H
charge: 0.026143 0.001759 -0.297459 -0.281636 -0.355988 -0.332777 -0.521293 0.305185 -0.493382 0.277387 0.270909 0.344008 0.338231 0.243035 0.242151 0.233728
chargesum: 0.00000
title: Mulliken charges with hydrogens summed into heavy atoms:
elementType: Cl Cl O O N C C C C
charge: 0.026143 0.001759 -0.297459 -0.281636 -0.017757 0.215518 -0.177285 0.305185 0.225532
polarizability: 1.00252233e+02 6.19570864e+00 7.91443301e+01 -4.92788928e+00 2.33261737e+00 4.88798663e+01
1716.lowfreq: -13.2565 -8.4131 -6.7977 0.0031 0.0031 0.0034 26.5919 54.0795 60.2836
frequency: 26.3768 54.0228 60.2726 74.6269 140.5204 193.8042 218.6590 236.5091 290.8167 333.4630 394.1088 517.7129 565.6924 601.2337 646.9929 700.4348 718.9915 843.2412 968.5022 1002.3630 1061.4899 1119.0720 1142.8438 1151.3988 1197.1071 1199.9656 1213.4118 1299.3913 1370.8523 1425.2288 1434.7344 1452.4185 1468.1612 1491.8500 1665.0448 3003.5414 3026.4276 3092.8483 3104.6430 3140.6917 3147.3673 3572.9080
redmass: 5.9488 7.2564 3.6254 1.2915 3.8588 5.3546 9.9659 3.5174 10.5732 5.1788 2.8935 4.2209 1.7829 2.2495 4.3346 10.8860 6.7936 3.6332 4.4726 2.7697 3.6622 1.2555 5.5807 1.4403 1.0914 1.3376 1.9115 1.1617 1.2768 1.1528 1.0874 1.0501 1.0694 1.8235 8.5406 1.0298 1.0594 1.1044 1.1049 1.0905 1.1044 1.0777
irintensity: 2.3927 1.2927 2.8172 2.8456 7.7125 6.2358 3.2302 4.5072 7.5655 22.3107 11.6925 30.6044 75.4767 96.4636 28.5657 39.9202 91.7422 26.2423 27.4497 32.3563 23.3954 0.6243 76.3966 49.9005 21.0415 14.8755 267.0038 48.7034 9.8808 4.1983 19.7881 13.8646 55.5842 327.7360 256.2371 40.2583 14.1497 1.5319 28.9781 3.0136 16.4716 44.0833
temp: 298.150 k
press: 1.00000 atm
elementType: 17 17 8 8 7 6 6 6 6 1 1 1 1 1 1 1
symmnumber: 1
zpe: 301278.0 jmol-1
zpe.correction: 0.114751 hartree
zpe.thermalcorrener: 0.125532 hartree
zpe.thermalcorrenthalpy: 0.126476 hartree
zpe.thermalcorrgfe: 0.075461 hartree
zpe.sumelectzpe: -1281.233409 hartree
zpe.sumelectthermal: -1281.222628 hartree
zpe.sumelectthermalent: -1281.221684 hartree
zpe.sumelectthermalfe: -1281.272699 hartree
dipole: 2.1725 1.1776 0.7221
dipole: 2.5745
quadrupole: -63.8128 -72.2937 -64.3475
quadrupole: 4.1261 -2.0700 -0.5712
quadrupole: 3.0052 -5.4757 2.4705 4.1261 -2.0700 -0.5712
hfenergy: -1281.3481598 hartree
pointgroup: C01 [X(C4H7Cl2N1O2)]
dipole: 0.8565721 0.4545324 0.2925525 debye
dipolederiv: -0.6244369 -0.3008668 -0.0311929 -0.278935 -0.3912434 -0.0064162 -0.028747 0.0376697 -0.1363003 -0.2370167 0.0877708 -0.0318791 0.0644202 -0.7173719 0.0593683 -0.0529314 -0.0174786 -0.1651847 -1.5555201 -0.2253008 0.2093671 -0.5636156 -0.5944201 0.0347522 0.1745262 -0.0365019 -0.3750704 -0.7060723 0.0208301 0.075548 0.0844891 -0.9150366 -0.2075952 0.1354281 -0.2227352 -0.4466909 -1.5001475 0.154713 0.140909 0.2330763 -0.3819884 -0.0271387 0.227424 -0.0615592 -0.6251027 0.6372287 0.0355147 -0.0304175 0.3022281 -0.0856453 -0.0730046 0.1737646 0.0033144 0.1982772 0.8200864 0.1999585 0.063537 0.2163337 1.2366522 -0.0037395 0.0302061 -0.0530439 0.2334826 2.2384829 0.0265228 -0.4313373 0.09515 1.3003089 0.3070537 -0.5665465 0.367704 0.5521028 0.7501524 0.008625 -0.1095491 -0.1150185 0.2263047 0.0017836 -0.1844283 -0.0269795 0.3237308 0.0814988 0.0629674 -0.0251119 -0.0440261 0.0128378 0.0025499 -0.0729538 0.0059228 0.1204669 -0.0406856 -0.0070274 0.0721839 -0.0183819 0.1240585 -0.0474534 0.0521395 -0.0182053 -0.0358013 -0.0088883 -0.0070157 0.0532009 0.0038722 -0.0498153 -0.0069577 -0.0081884 0.0031328 -0.0092379 0.1863249 0.0058335 0.0701374 -0.0523782 0.1881049 -0.0352088 0.0849492 -0.0209149 0.3522944 0.004612 -0.0107165 -0.0441785 0.0620147 0.0920672 -0.0702122 0.0431926 -0.0343874 -0.1131081 -0.0182198 0.0307942 0.0033859 0.1439059 -0.0180183 0.0807953 -0.0114309 0.0967586 0.0090198 -0.027399 -0.0826028 0.0153972 -0.1331348 -0.0267949 -0.0085767 0.0035959 -0.0226964 0.1171215 unknown
polarizability: 100.4047368|6.049176|79.0125081|-4.5561147|2.6259834|48.8591842 unknown
InChI: InChI=1S/C4H7Cl2NO2/c1-9-4(8)7-2-3(5)6/h3,7H,2H2,1H3
charge 0 multiplicity 1
16 atoms
Cl -3.556259 -1.034276 -0.196273
Cl -2.445409 1.826304 -0.214772
O  2.390844 0.683393 0.146923
O  1.399471 -1.401646 -0.339442
N  0.220614 0.338186 0.717972
C  -1.04402 -0.381202 0.808664
C  -2.009492 0.001564 -0.324335
C  1.332938 -0.237276 0.131002
C  3.655455 0.185615 -0.435307
H  -0.831037 -1.461495 0.723383
H  -1.531664 -0.191635 1.780808
H  -1.601275 -0.152874 -1.33088
H  0.278724 1.313231 1.014423
H  3.502118 -0.124729 -1.482552
H  4.034954 -0.672068 0.145338
H  4.345441 1.038809 -0.373251
