program: Gaussian 09
title: 000049182
version: EM64L-G09RevD.01
frameworkgroup: C1[X(C11H18N2O3S)]
method: RPBEPBE
basis: SDD
operation: Freq
keyword: #p
keyword: freq=noraman
keyword: PBEPBE/SDD
title: #p freq=noraman PBEPBE/SDD
converged: YES YES NO NO
title: Mulliken charges:
elementType: S O O O N N C C C C C C C C C C C H H H H H H H H H H H H H H H H H H
charge: 0.155254 -0.205782 -0.235279 -0.220331 -0.363333 -0.373247 0.136858 -0.437747 -0.800666 -0.371350 0.172145 0.197281 -0.357476 0.155477 -0.696931 -0.602638 -0.650319 0.253136 0.214686 0.292477 0.293543 0.203055 0.239790 0.198681 0.198277 0.368092 0.364560 0.215308 0.211871 0.220187 0.292776 0.251967 0.228473 0.229087 0.222116
chargesum: 0.00000
title: Mulliken charges with hydrogens summed into heavy atoms:
elementType: S O O O N N C C C C C C C C C C C
charge: 0.155254 -0.205782 -0.235279 -0.220331 0.004759 -0.008686 0.136858 0.030076 -0.214646 0.071495 0.172145 0.197281 0.039482 0.155477 -0.049565 -0.057895 0.029358
polarizability: 1.64879850e+02 -2.50916952e+00 1.72404786e+02 5.95418143e+00 1.52674088e+00 1.43954667e+02
1716.lowfreq: -9.3613 -0.0018 -0.0012 0.0015 4.6350 8.9439 27.4464 37.9570 43.0242
frequency: 27.4106 37.9263 43.0239 51.3697 63.8908 80.8614 94.1338 124.2248 132.8652 149.7956 154.0766 164.2153 205.3506 218.3880 228.9387 237.6410 240.8293 282.2696 347.6428 358.0954 361.3438 404.4752 434.2048 470.1588 487.9082 590.4826 612.9415 626.7348 647.9799 673.0843 689.6771 725.3282 733.4322 750.8878 756.4964 780.9666 789.5422 794.6936 821.1848 896.8906 912.2215 961.0251 991.9442 994.0073 1008.2514 1038.4282 1040.7339 1058.3009 1073.8860 1076.8195 1113.5867 1161.1505 1186.0896 1213.9175 1241.7526 1250.7887 1255.6866 1270.3622 1284.4756 1291.9691 1299.1633 1324.8575 1334.4120 1353.5058 1365.6854 1376.4006 1378.4481 1392.0612 1395.9531 1419.1846 1460.6554 1469.0959 1469.6076 1470.3386 1477.1107 1479.0486 1482.7540 1489.8502 1613.6419 1651.0142 1678.1759 2965.9554 2969.8468 2976.0735 2985.8415 2988.0519 3010.2675 3021.6872 3028.6540 3054.3886 3058.9640 3073.7592 3076.4674 3078.1405 3081.9027 3108.5027 3136.2965 3519.6026 3521.8683
redmass: 6.6548 3.4762 3.0517 1.8831 3.1139 3.9785 2.7487 5.0889 3.2025 5.9655 4.2263 10.8968 4.1011 1.5781 3.1237 1.2738 1.5245 2.6093 3.5088 11.9402 7.6160 3.2559 6.2237 5.5821 8.4677 9.5440 3.8681 4.3664 2.6410 2.8800 4.1111 2.1424 1.8619 2.0837 2.2832 1.4211 1.7032 1.1689 1.9198 1.7622 1.3434 6.3908 3.0141 1.8204 2.0160 1.2386 3.3121 2.1680 2.5009 2.2901 2.1488 2.6108 2.2370 1.5498 1.2374 1.4007 1.2985 1.4237 1.2670 1.1584 1.5753 1.7542 1.5879 1.5299 8.2010 1.6764 1.9039 1.2135 1.2059 1.0937 1.0840 1.0687 1.0498 1.0706 1.0448 1.0624 1.0485 1.0888 6.8109 8.6850 5.4917 1.0590 1.0597 1.0366 1.0354 1.0602 1.0990 1.0582 1.1010 1.0713 1.0887 1.1009 1.0995 1.1011 1.0994 1.1067 1.1079 1.0760 1.0778
irintensity: 0.3730 0.2015 0.1704 0.4700 0.6208 1.0564 1.4549 0.1962 0.2581 0.7912 0.8566 13.0288 0.5474 0.0626 0.5184 0.3283 0.0289 4.5681 2.2907 25.0481 21.0165 3.2662 10.2015 17.2351 14.1965 1.0099 6.4734 2.4286 0.4497 28.7603 7.3635 6.1794 12.5855 2.5031 3.6676 7.7851 196.4310 24.1578 2.5843 5.1523 3.9179 14.0654 10.2882 14.2966 2.0807 0.8530 6.5785 3.0064 2.5852 0.1736 14.2056 24.5721 17.8985 8.2666 15.1041 15.9345 14.7508 29.8981 9.3965 12.5363 107.0428 105.0017 87.5195 9.7786 204.4179 11.9661 4.0027 12.4222 18.5288 36.8419 4.1760 5.4391 11.3418 3.1473 13.0137 1.9781 8.6132 17.9929 280.5170 95.0432 624.1757 17.7448 17.8744 31.4677 34.8487 40.5921 9.6365 17.1117 0.6625 7.3699 14.9489 83.3363 48.3836 15.7426 17.5454 31.3195 0.6453 78.4957 52.4427
temp: 298.150 k
press: 1.00000 atm
elementType: 16 8 8 8 7 7 6 6 6 6 6 6 6 6 6 6 6 1 1 1 1 1 1 1 1 1 1 1 1 1 1 1 1 1 1
symmnumber: 1
zpe: 746194.6 jmol-1
zpe.correction: 0.284211 hartree
zpe.thermalcorrener: 0.303478 hartree
zpe.thermalcorrenthalpy: 0.304422 hartree
zpe.thermalcorrgfe: 0.234761 hartree
zpe.sumelectzpe: -1161.933628 hartree
zpe.sumelectthermal: -1161.914361 hartree
zpe.sumelectthermalent: -1161.913417 hartree
zpe.sumelectthermalfe: -1161.983078 hartree
dipole: 2.2393 -1.5951 -1.0846
dipole: 2.9555
quadrupole: -105.8752 -114.1587 -119.3470
quadrupole: 4.6200 4.2768 2.3923
quadrupole: 7.2518 -1.0318 -6.2200 4.6200 4.2768 2.3923
hfenergy: -1162.217839 hartree
pointgroup: C01 [X(C11H18N2O3S1)]
dipole: -0.5972618 -0.9236527 0.3771642 debye
polarizability: 163.3335722|-1.0635238|173.046173|7.3395157|1.1737075|144.8595573 unknown
InChI: InChI=1S/C11H18N2O3S/c1-3-5-6-11(7-17-4-2)8(14)12-10(16)13-9(11)15/h12-13H,3-7H2,1-2H3
charge 0 multiplicity 1
35 atoms
S  2.777672 -0.420156 -0.89311
O  0.207228 1.2109 -2.68182
O  0.399896 -0.784412 1.721108
O  -0.311987 3.76726 1.165241
N  -0.099452 2.442473 -0.749828
N  -0.064647 1.454037 1.396553
C  -0.037165 -0.066429 -0.595827
C  -1.5177 -0.591265 -0.839619
C  1.009207 -1.081086 -1.106428
C  -1.842808 -1.988476 -0.26744
C  0.066299 1.224775 -1.433099
C  0.150529 0.150276 0.91398
C  -3.345768 -2.320614 -0.425907
C  -0.173901 2.635552 0.639983
C  -3.695589 -3.73361 0.087723
C  3.401051 -1.568613 0.494308
C  4.785308 -1.088282 0.951306
H  -1.671185 -0.594216 -1.936472
H  -2.22659 0.151101 -0.418187
H  0.855866 -1.267924 -2.180127
H  0.936591 -2.020247 -0.538805
H  -1.249311 -2.761371 -0.793938
H  -1.561625 -2.046407 0.800846
H  -3.633973 -2.231323 -1.49323
H  -3.946339 -1.56723 0.123665
H  -0.112289 3.296144 -1.317634
H  -0.038825 1.583299 2.413462
H  -3.441731 -3.840847 1.158888
H  -3.135625 -4.508535 -0.468681
H  -4.773527 -3.948222 -0.027751
H  2.661022 -1.534361 1.31022
H  3.447211 -2.591016 0.081447
H  5.511324 -1.093446 0.118531
H  4.737695 -0.063923 1.361427
H  5.17124 -1.756105 1.743619
