program: Gaussian 09
title: 000049146
version: EM64L-G09RevD.01
frameworkgroup: C1[X(C12H18N2O3)]
method: RPBEPBE
basis: SDD
operation: Freq
keyword: #p
keyword: freq=noraman
keyword: PBEPBE/SDD
title: #p freq=noraman PBEPBE/SDD
converged: YES YES NO NO
title: Mulliken charges:
elementType: O O O N N C C C C C C C C C C C C H H H H H H H H H H H H H H H H H H
charge: -0.221447 -0.229186 -0.234950 -0.183043 -0.383447 0.066970 -0.078374 0.174745 0.105522 -0.280089 -0.726798 -0.715499 0.181884 -0.129901 -0.595765 -0.458621 -0.671876 0.250241 0.277571 0.229336 0.226375 0.226833 0.253528 0.205984 0.233514 0.363327 0.254754 0.253438 0.268205 0.256383 0.210337 0.212002 0.220217 0.222541 0.215292
chargesum: 0.00000
title: Mulliken charges with hydrogens summed into heavy atoms:
elementType: O O O N N C C C C C C C C C C C C
charge: -0.221447 -0.229186 -0.234950 -0.183043 -0.020120 0.066970 0.171867 0.174745 0.105522 -0.002518 -0.044254 -0.022473 0.181884 0.124852 0.182260 -0.036282 -0.013827
polarizability: 1.76930988e+02 9.59933514e+00 1.43750196e+02 2.98417523e+00 -4.69007953e+00 1.39900093e+02
1716.lowfreq: -13.6279 -9.3784 -5.5837 -0.0003 0.0004 0.0006 15.8117 31.9857 67.3835
frequency: 15.0321 31.7694 67.3790 76.5150 79.5107 96.9300 125.0267 133.1677 156.9918 174.1480 180.3166 197.2527 220.2993 241.8920 246.3412 276.1938 279.5400 322.7506 326.2513 348.4857 368.6600 383.0617 401.6370 430.4445 451.8842 480.3357 513.4623 583.6045 667.7181 678.5729 699.6398 714.4119 738.1499 773.0555 784.1702 813.4307 862.6328 885.5129 904.1839 928.3120 949.6372 959.6720 979.4014 990.8752 1012.0603 1058.6654 1071.8831 1090.2785 1125.9870 1131.7096 1148.7205 1158.8940 1180.0117 1186.5414 1232.5980 1246.0135 1277.7684 1299.2113 1304.1573 1323.3440 1325.4363 1350.6513 1365.8419 1382.3076 1384.2429 1387.5138 1401.8340 1432.0799 1460.6504 1464.1950 1467.6689 1474.3833 1475.7456 1483.8013 1484.4321 1486.9437 1489.1334 1579.7072 1632.5496 1656.0727 1670.6849 2968.2555 2974.2691 2980.4227 2988.3764 3001.9410 3019.3973 3030.0811 3066.2713 3076.2528 3077.4790 3080.7785 3084.5005 3096.2059 3101.7518 3109.5588 3112.1096 3149.4675 3512.6701
redmass: 5.0746 3.2998 2.5429 3.0669 3.0835 2.6588 1.2176 2.0093 8.0724 3.4086 3.4792 1.2582 1.3377 1.1448 2.6503 3.1208 3.5516 3.0560 3.1326 3.6312 6.7653 4.2477 3.9616 5.1176 4.1105 3.2583 5.4707 6.5815 4.1908 3.4243 4.5603 8.0021 3.0541 1.6961 1.8011 1.9591 2.6087 2.3779 2.0581 1.1871 1.6373 2.2531 1.9549 1.2616 2.2765 2.7123 1.8605 3.4099 2.1093 1.3097 2.7456 2.8844 2.1099 3.5002 1.9077 1.6429 1.2138 1.3813 2.2138 1.3652 1.4668 1.9161 3.5996 1.9882 1.2208 1.1999 1.2044 1.2724 1.0460 1.0743 1.0501 1.0492 1.0429 1.0966 1.0641 1.0460 1.0529 10.6262 6.4894 6.8650 6.7375 1.0616 1.0362 1.0353 1.0371 1.0843 1.0332 1.0982 1.0998 1.0985 1.0998 1.0977 1.1008 1.0931 1.0997 1.0878 1.1023 1.1026 1.0766
irintensity: 0.8788 0.2367 0.1360 1.2851 0.2392 0.1282 0.3014 0.7577 13.8088 0.5562 0.5820 0.4983 0.4664 0.1452 0.6751 1.1690 4.0604 1.4962 5.8561 2.2882 26.4538 19.0127 2.6224 6.0963 4.0335 2.8483 18.5202 1.5328 7.4960 12.6109 1.8708 3.7066 7.7142 14.4300 91.4962 2.9584 10.6271 1.2596 9.3180 7.6254 5.4229 4.2381 13.9540 40.7803 6.3477 24.1050 24.5450 15.4944 13.9326 0.0766 2.9280 7.9662 10.6150 39.6511 21.5219 35.8644 4.3359 38.3769 165.8986 0.3451 11.0255 173.8503 137.6559 13.4399 16.1070 9.3203 20.7379 124.9075 5.1994 8.2789 0.5441 19.9255 11.7918 13.5000 13.4820 15.8589 13.1375 321.3888 222.5852 339.5385 1.5637 32.6051 26.1708 38.1199 26.8395 3.2313 20.1145 10.5345 27.8938 8.6892 47.0809 47.4327 42.7806 3.4184 18.3550 13.0324 13.4697 0.4664 61.9603
temp: 298.150 k
press: 1.00000 atm
elementType: 8 8 8 7 7 6 6 6 6 6 6 6 6 6 6 6 6 1 1 1 1 1 1 1 1 1 1 1 1 1 1 1 1 1 1
symmnumber: 1
zpe: 751684.1 jmol-1
zpe.correction: 0.286301 hartree
zpe.thermalcorrener: 0.305100 hartree
zpe.thermalcorrenthalpy: 0.306044 hartree
zpe.thermalcorrgfe: 0.238440 hartree
zpe.sumelectzpe: -801.974524 hartree
zpe.sumelectthermal: -801.955725 hartree
zpe.sumelectthermalent: -801.954781 hartree
zpe.sumelectthermalfe: -802.022385 hartree
dipole: 0.6836 0.0720 -0.7748
dipole: 1.0358
quadrupole: -100.1162 -101.8413 -109.9612
quadrupole: -6.1600 1.5011 1.0905
quadrupole: 3.8567 2.1316 -5.9883 -6.1600 1.5011 1.0905
hfenergy: -802.2608251 hartree
pointgroup: C01 [X(C12H18N2O3)]
dipole: 0.2934084 -0.0256242 0.2816255 debye
polarizability: 176.4386078|-9.518808|143.5318491|-5.9589763|-3.9507692|140.6108194 unknown
InChI: InChI=1S/C12H18N2O3/c1-5-6-7-12(8(2)3)9(15)13-11(17)14(4)10(12)16/h6-8,13H,5H2,1-4H3
charge 0 multiplicity 1
35 atoms
O  -0.73459 0.052664 2.476619
O  0.431759 -0.86568 -2.168699
O  -3.119984 1.875109 -1.09069
N  -1.907674 0.982704 0.718572
N  -1.327362 0.465235 -1.530041
C  0.104194 -0.544197 0.256778
C  0.034641 -2.099239 0.632531
C  -0.870915 0.171448 1.228824
C  -0.222082 -0.347365 -1.224077
C  1.493875 0.023453 0.606218
C  -1.360839 -2.687358 0.311457
C  1.154955 -2.940601 -0.010949
C  -2.182059 1.158854 -0.655818
C  2.450992 0.462725 -0.248252
C  -2.774106 1.681578 1.699424
C  3.796301 0.998663 0.195817
C  4.04385 2.448025 -0.298542
H  0.174019 -2.106819 1.731634
H  1.674681 0.042018 1.690903
H  -1.549749 -2.702671 -0.778387
H  -1.418384 -3.730456 0.670257
H  -2.177254 -2.124875 0.802295
H  1.057898 -2.973013 -1.10891
H  1.098162 -3.974541 0.378212
H  2.153762 -2.538028 0.228773
H  -1.534485 0.594071 -2.526537
H  2.280313 0.428342 -1.333602
H  -3.309976 0.944994 2.31971
H  -3.487878 2.300802 1.138449
H  -2.152741 2.305854 2.360712
H  4.597436 0.346112 -0.209011
H  3.877117 0.958027 1.298775
H  5.046605 2.800703 0.00422
H  3.292953 3.14111 0.12117
H  3.981665 2.507553 -1.401035
