program: Gaussian 09
title: 000049096
version: EM64L-G09RevD.01
frameworkgroup: C1[X(C10H12ClNO2)]
method: RPBEPBE
basis: SDD
operation: Freq
keyword: #p
keyword: freq=noraman
keyword: PBEPBE/SDD
title: #p freq=noraman PBEPBE/SDD
converged: NO YES NO NO
title: Mulliken charges:
elementType: Cl O O N C C C C C C C C C C H H H H H H H H H H H H
charge: -0.070297 -0.294599 -0.282051 -0.617811 -0.557189 -0.393455 0.601350 -0.255937 -0.322154 -0.402643 -0.228030 -0.233471 -0.229888 0.289898 0.231893 0.213086 0.223220 0.239982 0.223666 0.228913 0.238564 0.254957 0.231226 0.235093 0.335883 0.339791
chargesum: 0.00000
title: Mulliken charges with hydrogens summed into heavy atoms:
elementType: Cl O O N C C C C C C C C C C
charge: -0.070297 -0.294599 -0.282051 0.057864 -0.112209 0.069747 0.601350 0.196642 -0.322154 -0.164079 0.026928 -0.002245 0.005205 0.289898
polarizability: 1.65560493e+02 1.23436370e+01 1.25004636e+02 -1.49256663e+01 2.42428592e+00 9.19293339e+01
1716.lowfreq: -18.7523 -9.2623 -5.4043 -0.0012 0.0007 0.0007 14.8728 25.3080 48.6329
frequency: 14.5810 25.0411 48.5638 58.4940 94.0984 114.4067 149.7691 161.5515 227.8585 249.4378 268.7044 354.2182 369.2730 422.4983 450.9987 469.2592 490.0078 514.9850 535.9581 581.8390 625.1044 660.9354 705.4275 728.7061 756.4443 761.1301 805.2654 843.6009 851.9104 868.4839 946.8193 985.0320 1011.6141 1013.4619 1026.8297 1037.7098 1056.5134 1059.0377 1088.0727 1132.5155 1168.3109 1174.4340 1214.5234 1251.4222 1262.2039 1276.1109 1290.3103 1299.5332 1335.7890 1375.5952 1386.7300 1425.6814 1463.1144 1471.5548 1475.2912 1490.0781 1575.2827 1587.5328 1606.9584 1685.8273 2989.0692 2995.3946 3009.8835 3041.2068 3052.8916 3083.5454 3125.2243 3142.4265 3159.8552 3175.7853 3559.4997 3718.1832
redmass: 8.6369 5.9762 4.7734 4.1015 1.8742 5.4521 5.8233 3.9281 4.8795 4.9888 4.1167 4.7993 3.9386 4.1309 3.4189 3.2467 1.1796 1.0536 3.7730 5.3680 5.5747 6.2999 11.0477 4.0770 1.1768 1.1635 4.3823 4.0496 1.3306 1.4067 1.3883 1.3313 7.4779 6.3802 3.6500 2.1927 2.0820 1.7151 3.0347 1.5119 1.1510 1.0928 2.2306 1.3070 1.3022 1.1592 1.2754 2.3871 1.5117 7.2010 1.6610 2.1758 2.2865 1.1507 1.0976 1.0911 6.0936 1.2150 7.2364 7.4594 1.0592 1.0577 1.0591 1.1005 1.1062 1.1067 1.0877 1.0892 1.0948 1.0995 1.0445 1.1058
irintensity: 2.3517 3.0807 0.6011 0.7191 0.7297 4.0074 0.8759 10.4215 0.8004 2.5911 7.0204 6.6121 7.4257 2.3325 14.7567 0.8972 303.6596 21.5430 3.3883 4.0834 0.0692 18.7042 32.8481 1.9816 48.1789 40.6911 11.9720 22.9899 2.4481 0.3271 2.0628 0.0375 129.2259 61.7822 7.5477 15.4472 38.2826 14.4141 30.7884 2.2306 2.0209 1.6615 0.7341 1.1046 1.3414 0.6061 17.5960 457.8759 36.2468 1.6505 27.8628 18.2811 32.5202 3.8865 4.7291 15.4439 8.5273 107.8179 0.5896 374.4719 15.7579 15.8671 37.8887 5.9863 1.4613 45.5068 6.4711 9.5070 17.3033 12.8633 61.0940 49.5153
temp: 298.150 k
press: 1.00000 atm
elementType: 17 8 8 7 6 6 6 6 6 6 6 6 6 6 1 1 1 1 1 1 1 1 1 1 1 1
symmnumber: 1
zpe: 534942.5 jmol-1
zpe.correction: 0.203749 hartree
zpe.thermalcorrener: 0.217981 hartree
zpe.thermalcorrenthalpy: 0.218925 hartree
zpe.thermalcorrgfe: 0.159124 hartree
zpe.sumelectzpe: -1052.498875 hartree
zpe.sumelectthermal: -1052.484643 hartree
zpe.sumelectthermalent: -1052.483699 hartree
zpe.sumelectthermalfe: -1052.543500 hartree
dipole: -1.1756 -1.8463 2.5721
dipole: 3.3774
quadrupole: -79.3544 -87.3122 -88.9096
quadrupole: 3.9982 13.0017 1.3672
quadrupole: 5.8376 -2.1201 -3.7175 3.9982 13.0017 1.3672
hfenergy: -1052.7026243 hartree
pointgroup: C01 [X(C10H12Cl1N1O2)]
dipole: -0.4934546 -0.8002862 0.9389701 debye
dipolederiv: -0.2638315 -0.2324269 0.0205286 -0.2293029 -0.6735632 -0.0145058 0.0126929 -0.019112 -0.0892949 -1.9522491 -0.0086311 -0.1743929 -0.0425839 -0.2967009 0.0168227 -0.0163494 0.0226728 -0.4924373 -0.8276724 -0.0243617 0.1393788 -0.0409476 -0.3635279 0.0748047 0.2373242 0.0744411 -1.0101901 -0.8392301 0.0548281 -0.4762704 0.0602177 -0.7403068 0.0071844 -0.5494717 0.0064438 -0.8944898 -0.1375397 -0.0410827 0.0106373 -0.0304187 0.1342762 0.0147526 -0.0525551 0.0386089 0.1394829 -0.0739214 -0.0007765 0.0081599 -0.0191923 0.1292794 0.0034546 0.1239629 -0.0175919 0.01026 0.2818882 -0.0737703 -0.0856311 -0.0072889 -0.2672331 -0.0358045 -0.1309469 -0.0207488 -0.0133453 0.8751077 -0.0211883 0.1773998 -0.0251928 0.3622857 0.0098957 0.3287575 0.0188679 0.3754813 0.1718992 0.3753454 -0.0430956 0.3729814 0.9370608 0.0397587 -0.0197988 0.0569079 -0.049791 -0.1051622 0.0424733 -0.0488946 -0.0759119 0.0632706 0.0777515 -0.0511284 0.0271909 -0.1178533 -0.1100666 -0.1109298 -0.0192923 -0.1156466 -0.1684749 0.0379825 -0.0189159 0.0346735 -0.0820421 -0.0525005 0.0538969 -0.030119 0.0756293 0.0668337 0.02039 -0.0221365 0.0262795 -0.1273212 0.0234347 -0.0014434 -0.1008876 0.0342363 -0.0057786 0.0184537 -0.0795087 0.0389032 -0.1146214 2.2964135 0.0138249 0.2973578 0.0627539 0.3480222 -0.1329376 -0.0196436 -0.1397039 1.6723929 0.0434796 -0.0137366 0.0229209 -0.0307252 -0.0415046 0.1181082 0.0138205 0.0548149 0.0258797 0.0368013 0.0105068 0.0201252 0.0351914 -0.0434838 -0.1423253 0.0192795 -0.0796338 -0.0349918 0.057173 -0.032993 -0.0030935 -0.0103224 -0.0794391 0.1016433 0.025118 0.0736091 0.017812 0.082193 0.0257337 0.0171298 -0.0052354 -0.0087076 -0.1007356 0.0460071 -0.0716418 -0.0221521 -0.0151774 0.0230137 -0.0036673 0.0260777 -0.0406178 -0.1058601 -0.0657641 -0.0790684 -0.0524054 -0.0091026 -0.0150286 -0.0154757 -0.0012194 -0.086145 0.0926288 -0.0786662 0.0600825 -0.0046288 0.0522108 0.0733366 0.0703604 0.0621265 -0.0308174 -0.0617551 0.0645297 -0.0727864 0.0952842 0.0741345 0.0384538 0.0457195 0.0580935 0.0020866 -0.0607801 0.0552588 -0.0551568 0.1280727 0.046611 -0.0873382 0.0274085 -0.1031326 -0.0726477 -0.013116 0.0306694 -0.0164525 0.1457533 -0.0748787 -0.0305361 0.0975669 -0.0288186 0.0758373 -0.0071647 0.1017141 -0.0058484 0.1174728 0.204641 -0.0070072 0.0075357 -0.0140006 0.4012694 0.0187267 0.052701 0.0215217 0.1958483 0.2153446 -0.010163 0.0385909 -0.0073679 0.3987266 0.0226267 -0.0069502 0.0227268 0.1818244 unknown
polarizability: 166.5422469|12.1677034|123.3577923|-13.3301247|5.9494407|92.5944238 unknown
InChI: InChI=1S/C10H12ClNO2/c11-9-6-2-1-4-8(9)5-3-7-14-10(12)13/h1-2,4,6H,3,5,7,12H2
charge 0 multiplicity 1
26 atoms
Cl -1.663173 2.555849 0.113003
O  3.102128 -0.164495 0.561725
O  4.866951 0.057806 -0.989683
N  5.245916 -0.178016 1.317827
C  -0.354878 -0.080691 -1.057969
C  0.739307 -0.182826 0.042378
C  -1.754903 -0.197077 -0.482226
C  2.137459 -0.049386 -0.562425
C  -2.44954 0.895713 0.089763
C  -2.428434 -1.448488 -0.46591
C  -3.736413 0.784492 0.649927
C  -3.717093 -1.595154 0.091263
C  -4.374796 -0.476156 0.650774
C  4.458825 -0.083783 0.189806
H  -0.241506 0.884715 -1.58616
H  -0.198689 -0.884144 -1.802978
H  0.653882 -1.152945 0.566083
H  0.586682 0.612098 0.794409
H  2.351429 -0.845318 -1.300476
H  2.282014 0.928058 -1.059556
H  -1.922162 -2.316704 -0.904833
H  -4.228228 1.664515 1.074054
H  -4.20714 -2.574472 0.085419
H  -5.375958 -0.575519 1.083033
H  4.821354 -0.281532 2.236009
H  6.255065 -0.13294 1.212342
