program: Gaussian 09
title: 000049121
version: EM64L-G09RevD.01
frameworkgroup: C1[X(C10H15N3O2)]
method: RPBEPBE
basis: SDD
operation: Freq
keyword: #p
keyword: freq=noraman
keyword: PBEPBE/SDD
title: #p freq=noraman PBEPBE/SDD
converged: YES YES NO NO
title: Mulliken charges:
elementType: O O N N N C C C C C C C C C C H H H H H H H H H H H H H H H
charge: -0.321166 -0.287559 -0.326242 -0.133323 -0.022239 0.006098 -0.426704 0.274834 -0.271671 -0.168914 0.283586 -0.380100 -0.624219 -0.611496 -0.638192 0.223469 0.220887 0.271409 0.313001 0.229369 0.240739 0.224492 0.220215 0.201499 0.229518 0.275483 0.227637 0.215526 0.223359 0.330705
chargesum: 0.00000
title: Mulliken charges with hydrogens summed into heavy atoms:
elementType: O O N N N C C C C C C C C C C
charge: -0.321166 -0.287559 -0.054833 -0.133323 -0.022239 0.006098 0.017651 0.274834 0.041330 0.060455 0.283586 -0.139361 0.021988 0.121142 0.131399
polarizability: 1.77823535e+02 1.53471817e+01 1.56994034e+02 2.38744050e+00 7.10388463e+00 8.04571223e+01
1716.lowfreq: -7.1734 -3.0322 -0.0001 0.0005 0.0009 4.7582 27.5519 41.5160 58.1778
frequency: 27.4323 41.4776 58.1760 85.0453 102.0718 108.2127 124.4354 135.0673 175.5689 191.6095 222.1532 251.3189 265.0445 267.4791 312.8440 330.2610 361.0153 410.1143 443.6012 469.9337 541.8867 592.9460 611.1587 613.0660 679.1440 700.5717 755.4115 768.9469 797.0424 815.9294 868.6656 931.3335 939.0306 955.7156 981.9266 987.1820 1053.7571 1067.3871 1082.1102 1100.6241 1107.6286 1117.6778 1130.0360 1145.9615 1150.2509 1184.3982 1219.2533 1236.3773 1249.0891 1262.8305 1333.8010 1354.4856 1366.6711 1422.3533 1423.6141 1431.1615 1441.0487 1446.3196 1449.7186 1464.1197 1470.3209 1472.5842 1480.7481 1492.6378 1494.5668 1508.6781 1563.4606 1563.9511 1666.2589 2884.5109 2919.3413 2958.5816 2973.7206 3009.1903 3019.2887 3044.0304 3048.6700 3073.4970 3085.9395 3123.9051 3134.1349 3159.8371 3199.2034 3439.5563
redmass: 4.0793 4.1411 3.8957 3.1004 2.1833 3.3203 1.4380 1.8275 1.5494 4.1372 1.7864 1.7880 2.2765 3.9799 3.6218 4.7206 3.4533 3.4200 3.2188 4.4275 4.1342 6.1517 7.1078 5.2165 10.1835 1.4981 5.7218 3.8114 4.3392 1.5318 5.0510 1.3867 2.0415 1.7880 3.3716 1.3383 2.2315 1.4200 1.8092 1.2173 1.7019 2.4089 2.3083 1.8185 1.3768 1.9250 1.8595 2.2677 3.9695 1.7097 5.0720 1.4077 3.1053 1.2022 1.9128 1.1796 2.8904 1.1642 1.1611 1.0807 1.0761 1.0548 1.0458 1.0816 1.0820 1.0741 6.4788 6.7037 8.2072 1.0538 1.0669 1.0349 1.0361 1.0781 1.0922 1.0997 1.1019 1.0991 1.1037 1.0977 1.0879 1.0967 1.0957 1.0747
irintensity: 2.3300 2.3144 0.5009 1.7414 5.9575 5.2107 0.7852 0.3833 1.2515 1.2110 0.3922 0.6275 6.3212 0.9302 0.8377 5.1378 18.4313 1.4562 6.3834 0.1446 6.2056 7.1150 5.1439 7.1473 13.6723 110.4276 14.7020 6.0348 17.2312 59.5969 6.6099 0.6492 6.9630 9.0547 36.9914 3.1652 4.6703 9.8948 52.0764 0.7002 15.8957 498.3893 124.6844 0.7470 4.1651 143.2045 71.2897 43.8587 5.8899 0.3954 21.7169 4.2171 185.3844 37.0467 59.5474 14.7428 68.8801 26.5934 11.8200 11.3446 7.3566 17.1927 10.2892 23.6064 18.7484 22.7049 3.7735 29.1013 332.7413 146.0916 82.6301 55.2751 94.7779 49.9352 16.0562 47.2337 25.3994 38.1545 10.0202 2.5727 8.2488 33.1967 5.9899 0.4487
temp: 298.150 k
press: 1.00000 atm
elementType: 8 8 7 7 7 6 6 6 6 6 6 6 6 6 6 1 1 1 1 1 1 1 1 1 1 1 1 1 1 1
symmnumber: 1
zpe: 639703.7 jmol-1
zpe.correction: 0.243650 hartree
zpe.thermalcorrener: 0.259594 hartree
zpe.thermalcorrenthalpy: 0.260538 hartree
zpe.thermalcorrgfe: 0.199114 hartree
zpe.sumelectzpe: -703.603760 hartree
zpe.sumelectthermal: -703.587816 hartree
zpe.sumelectthermalent: -703.586872 hartree
zpe.sumelectthermalfe: -703.648296 hartree
dipole: 2.1293 2.2334 -0.7026
dipole: 3.1648
quadrupole: -81.4232 -84.6230 -89.5091
quadrupole: 8.9113 1.8741 1.0832
quadrupole: 3.7619 0.5621 -4.3240 8.9113 1.8741 1.0832
hfenergy: -703.8474098 hartree
pointgroup: C01 [X(C10H15N3O2)]
dipole: 1.0140089 -0.7192347 0.0691848 debye
polarizability: 183.4630879|-7.6449035|141.8712644|-6.6502658|24.9431434|89.9403385 unknown
InChI: InChI=1S/C10H15N3O2/c1-11-7-8-9(5-4-6-12-8)15-10(14)13(2)3/h4-6,11H,7H2,1-3H3
charge 0 multiplicity 1
30 atoms
O  0.648113 0.554295 -0.30191
O  1.448124 2.571227 0.673278
N  -0.169172 -2.506923 -0.254865
N  2.861486 0.747387 0.213615
N  -2.858994 -0.477549 -0.271841
C  -1.510761 -0.431374 -0.480296
C  -0.886702 -1.611425 -1.202145
C  -0.728618 0.672071 -0.026201
C  -1.349493 1.761553 0.626751
C  -2.746749 1.694479 0.830002
C  1.653328 1.402379 0.25261
C  -3.459572 0.565491 0.374821
C  0.400889 -3.706524 -0.902957
C  4.076861 1.494047 0.57678
C  3.021577 -0.66415 -0.187487
H  -1.70648 -2.131344 -1.749115
H  -0.148084 -1.251511 -1.943514
H  -0.781006 -2.755687 0.535138
H  -0.756772 2.617627 0.952775
H  -3.270752 2.513882 1.332626
H  -4.541988 0.480138 0.520258
H  0.883189 -4.345286 -0.141992
H  1.17921 -3.399743 -1.627382
H  -0.344243 -4.326181 -1.458486
H  4.564218 1.034133 1.457254
H  3.802208 2.531194 0.819864
H  4.794743 1.492598 -0.265431
H  3.745803 -1.14728 0.494664
H  3.412252 -0.739308 -1.221662
H  2.056385 -1.192416 -0.12315
