program: Gaussian 09
title: 000005000
version: EM64L-G09RevD.01
frameworkgroup: C1[X(C11H10ClN3O)]
method: RPBEPBE
basis: SDD
operation: Freq
keyword: #p
keyword: freq=noraman
keyword: PBEPBE/SDD
title: #p freq=noraman PBEPBE/SDD
converged: YES YES NO NO
title: Mulliken charges:
elementType: Cl O N N N C C C C C C C C C C C H H H H H H H H H H
charge: -0.046280 -0.198459 -0.223630 -0.406607 -0.096822 -0.142933 -0.440818 0.162549 0.394087 0.301877 -0.027638 -0.687364 -0.268793 -0.421860 -0.279554 -0.194821 0.259812 0.254850 0.260292 0.348374 0.262867 0.214820 0.229716 0.242437 0.263173 0.240726
chargesum: 0.00000
title: Mulliken charges with hydrogens summed into heavy atoms:
elementType: Cl O N N N C C C C C C C C C C C
charge: -0.046280 -0.198459 -0.223630 -0.058233 -0.096822 0.116880 0.074324 0.162549 0.394087 0.301877 -0.027638 0.020039 -0.268793 -0.179423 -0.016381 0.045906
polarizability: 2.31724656e+02 6.81958819e+00 1.62296002e+02 -4.71549705e+00 -4.51187332e+00 7.18005354e+01
1716.lowfreq: -8.2919 0.0012 0.0016 0.0019 4.1432 6.4215 39.5870 60.0219 105.8836
frequency: 39.4386 60.0201 105.8653 124.2899 136.1117 187.4172 214.0202 221.8249 230.3314 257.3265 290.8790 343.7884 379.1153 413.0068 426.0658 494.7709 525.0992 559.7494 573.6885 578.7047 627.6920 642.3203 682.7056 697.6050 704.0368 739.8335 765.7799 778.6288 785.6487 820.9735 878.3137 916.6333 964.8003 979.1022 1009.0242 1037.1463 1070.6084 1088.1297 1121.2161 1140.8957 1161.2570 1192.4310 1201.1786 1221.3591 1224.9382 1232.1090 1276.3865 1298.8633 1335.2396 1367.6292 1386.0485 1394.3382 1452.0476 1469.9623 1470.9161 1474.7386 1483.2430 1540.5267 1553.2184 1596.4571 1619.9733 1673.4491 2936.7577 2982.8403 2989.8289 2994.9496 3088.0475 3102.1699 3138.1694 3161.4770 3184.9025 3577.0912
redmass: 4.2781 4.9392 3.3319 4.9074 8.9533 5.4578 1.0723 3.8016 4.1121 6.4094 5.6568 5.8227 10.0172 4.7622 5.5161 3.4177 5.8065 4.4271 2.2048 1.7725 6.5848 6.6975 6.5204 3.4596 4.1997 4.7573 3.5355 1.5792 5.0770 3.9274 1.4063 6.0742 1.3355 2.2118 1.7579 1.6300 2.1091 2.8547 3.8173 2.5629 1.8156 2.1074 1.8235 1.1941 2.0327 1.9077 2.4334 1.3593 2.2799 2.2996 1.2119 3.7304 2.8950 1.6293 1.0776 1.2934 1.4657 3.6145 3.9771 6.1686 7.7121 10.8562 1.0659 1.0826 1.0409 1.0892 1.1007 1.1001 1.0887 1.0930 1.0978 1.0779
irintensity: 2.3254 3.6802 4.9819 0.3833 1.4549 0.4111 0.1639 2.5340 4.1374 5.6120 5.7047 4.8411 2.9495 9.5251 3.1456 1.2988 0.9569 1.8933 32.7106 45.1628 8.0204 22.1574 5.7939 40.8774 0.5327 3.1941 3.4332 80.8789 16.7864 20.6391 1.7604 38.6877 1.2340 14.4471 3.1551 26.3927 3.6349 49.6982 114.5784 28.0686 10.5887 22.2698 16.9024 1.5411 10.8802 24.0193 18.7726 20.4427 16.5104 25.5368 29.7939 58.5225 56.2650 33.6223 9.2729 40.0847 42.4727 315.2209 1094.5601 218.9548 126.3761 52.1304 31.1224 20.4043 10.7445 20.9183 18.5136 14.9887 7.0442 9.9047 3.1424 72.6069
temp: 298.150 k
press: 1.00000 atm
elementType: 17 8 7 7 7 6 6 6 6 6 6 6 6 6 6 6 1 1 1 1 1 1 1 1 1 1
symmnumber: 1
zpe: 510776.4 jmol-1
zpe.correction: 0.194544 hartree
zpe.thermalcorrener: 0.208056 hartree
zpe.thermalcorrenthalpy: 0.209000 hartree
zpe.thermalcorrgfe: 0.153689 hartree
zpe.sumelectzpe: -1123.590815 hartree
zpe.sumelectthermal: -1123.577304 hartree
zpe.sumelectthermalent: -1123.576359 hartree
zpe.sumelectthermalfe: -1123.631670 hartree
dipole: -6.8630 0.3861 0.2471
dipole: 6.8783
quadrupole: -128.9356 -90.0847 -100.7774
quadrupole: 18.0518 0.4497 -1.3815
quadrupole: -22.3363 16.5145 5.8218 18.0518 0.4497 -1.3815
hfenergy: -1123.7853593 hartree
pointgroup: C01 [X(C11H10Cl1N3O1)]
dipole: -2.677294 -0.3904497 -0.0534386 debye
dipolederiv: -0.1609104 -0.0627982 0.0015625 -0.175077 -0.7106507 0.0532 0.011303 0.052446 -0.0681526 -1.597421 -0.0686803 -0.0416052 0.0883168 -0.4379434 -0.0084049 -0.0141989 -0.0026462 -0.3467078 -0.6916403 -0.0316885 0.0436338 -0.2293842 -0.9351317 -0.0088354 0.0285478 -0.0594817 -0.2947801 -2.0862259 0.0653911 -0.0168471 0.204057 -0.4553281 -0.0050714 -0.0654826 -0.0069173 -0.3291506 -2.0928654 -0.0206004 -0.026 0.5313251 -0.5823718 -0.0090621 -0.0611271 0.0232562 -0.3042341 0.3087151 -0.4377525 -0.003803 -0.3334957 -0.1711157 -0.0031915 0.0330324 0.0212953 0.3587008 0.4222501 0.2538198 -0.0546407 0.348294 0.2539113 -0.0341318 -0.0679906 0.0084251 0.3813301 2.4765412 -0.0127873 0.045475 -0.1921225 1.1312025 -0.0140832 0.0870818 -0.032301 0.1907386 -0.2136429 -0.0762557 0.0090644 -0.6036618 -0.2978887 0.0089303 0.0639532 0.013228 -0.037 1.4267917 0.2511653 0.0116722 0.7230902 0.1812668 0.0071221 -0.0031789 0.0053541 0.0955303 2.1229657 0.0614899 0.0696383 -0.8377425 0.7723571 -0.0114617 0.0599622 -0.0629144 0.1097347 -0.0309121 0.0329266 0.0091135 0.0823015 0.0612681 -0.0500593 0.006042 -0.0066371 0.0056057 0.3226168 0.040114 0.0163105 0.3657769 1.0873988 -0.0967882 -0.0128419 -0.09686 -0.0492936 -0.4905011 -0.1271577 0.0106105 0.1171374 0.0536805 -0.0163025 -0.0213635 -0.0260989 -0.1942352 -0.2287017 0.0655807 -0.0039651 -0.0511677 -0.4107126 0.0280163 0.0008457 0.027759 -0.141766 0.2248359 0.1170747 0.0020969 0.003557 0.1918268 -0.0290471 0.0216494 -0.0212032 -0.1220048 0.0350093 0.0283517 0.0202863 0.0497228 0.0347018 0.0541291 -0.0260809 0.0607662 -0.0954202 -0.0258755 -0.013331 -0.0176403 -0.0232656 -0.008623 0.0726269 0.0211309 0.1191006 -0.0769177 0.0194655 -0.015037 0.0049283 -0.0204057 -0.0447973 -0.0623104 -0.002494 -0.093026 -0.0062756 0.1426867 0.0221328 -0.0063097 0.0088273 0.2510248 0.0078583 -0.0149322 0.0133002 0.3405035 -0.0764512 0.0765388 0.0005576 0.0007605 0.095141 -0.002594 -0.0254267 -0.0079451 0.1032847 0.0613439 -0.1316656 0.0096603 -0.0737795 -0.1065735 -0.0113991 0.0384193 -0.001304 0.0577021 0.0942245 0.011193 -0.0634998 0.0165883 0.0364008 0.0891168 -0.0319987 0.0323286 -0.0809829 0.0796997 -0.0639318 -0.0000089 -0.027026 -0.0792751 0.0201892 -0.0020923 0.0190328 0.1714535 -0.0028517 -0.0460108 -0.0045806 -0.0606225 0.0718236 0.0056441 -0.0049158 0.0058197 0.174435 -0.0391469 0.0819183 -0.0157098 0.0879958 0.0184078 0.0159093 -0.0178436 0.0152229 0.1579021 unknown
polarizability: 232.5045475|-0.6483235|161.6102407|2.5464532|-4.3573061|71.7064053 unknown
InChI: InChI=1S/C11H10ClN3O/c1-6-10(16)14-11-13-9-4-2-3-8(12)7(9)5-15(6)11/h2-4,6,13H,5H2,1H3
charge 0 multiplicity 1
26 atoms
Cl -2.83548 -2.727189 0.209811
O  4.562918 0.398279 0.126973
N  1.103482 -0.460071 0.108715
N  0.024747 1.652518 -0.015742
N  2.41444 1.457325 0.041905
C  2.482077 -0.985343 0.193945
C  -0.126129 -1.250144 0.235745
C  1.181323 0.912488 0.047484
C  -1.358944 -0.365527 0.080348
C  -1.254128 1.053358 -0.032783
C  3.309126 0.357303 0.12464
C  2.870579 -1.964355 -0.927562
C  -2.656893 -0.912376 0.060555
C  -2.412169 1.859145 -0.158786
C  -3.826873 -0.139928 -0.062569
C  -3.687808 1.262059 -0.172345
H  2.65139 -1.453153 1.185486
H  -0.153661 -1.763822 1.221386
H  -0.140814 -2.04909 -0.531649
H  0.132377 2.66518 -0.076457
H  3.958002 -2.143618 -0.867644
H  2.350076 -2.93441 -0.832529
H  2.646872 -1.532903 -1.918669
H  -2.310376 2.94653 -0.245559
H  -4.809741 -0.616991 -0.071543
H  -4.580791 1.887236 -0.269356
