program: Gaussian 09
title: 000049056
version: EM64L-G09RevD.01
frameworkgroup: C1[X(C16H25NO2S)]
method: RPBEPBE
basis: SDD
operation: Freq
keyword: #p
keyword: freq=noraman
keyword: PBEPBE/SDD
title: #p freq=noraman PBEPBE/SDD
converged: YES YES NO NO
title: Mulliken charges:
elementType: S O O N C C C C C C C C C C C C C C C C H H H H H H H H H H H H H H H H H H H H H H H H H
charge: 0.176084 -0.282313 -0.255051 -0.105954 -0.342715 -0.401200 -0.324084 -0.322843 -0.257232 -0.675735 -0.672807 0.178561 0.234505 -0.359707 -0.354258 -0.168881 -0.214779 -0.214403 -0.621082 -0.610209 0.182538 0.201304 0.210210 0.232055 0.187356 0.205281 0.185727 0.204748 0.225047 0.225334 0.229322 0.207283 0.207092 0.229264 0.207295 0.207174 0.295050 0.273877 0.250639 0.235390 0.254413 0.252904 0.215552 0.230578 0.238671
chargesum: 0.00000
title: Mulliken charges with hydrogens summed into heavy atoms:
elementType: S O O N C C C C C C C C C C C C C C C C
charge: 0.176084 -0.282313 -0.255051 -0.105954 0.041127 0.041064 0.068554 0.067632 0.193149 -0.032038 -0.029073 0.178561 0.234505 -0.064658 -0.080382 -0.168881 0.035859 0.020987 -0.113764 0.074591
polarizability: 2.57145019e+02 -1.04738746e+01 2.25439510e+02 -1.93986885e+00 4.12432645e+00 1.52442911e+02
1716.lowfreq: -10.3743 -4.5130 -0.0024 -0.0011 -0.0010 3.8417 5.7495 9.8152 20.9119
frequency: -9.0490 9.3966 20.7965 27.5950 46.0679 56.0897 67.9906 75.9675 79.2902 95.1313 111.5710 126.4660 128.8212 169.5561 185.6586 199.5798 213.5071 223.8030 233.2233 254.8706 286.7017 294.4170 306.1401 327.5593 336.5174 380.0794 393.6778 425.6868 429.2019 464.2239 482.4510 513.2211 520.0460 595.1608 648.2296 682.8785 712.7380 724.3638 740.3797 760.5069 765.3211 795.3583 797.2553 816.8066 828.3608 852.2679 918.2245 921.4917 935.9776 949.0789 980.1643 986.6192 989.4724 998.8432 1042.5079 1044.1746 1056.2878 1065.7116 1074.3705 1075.0818 1076.0268 1079.6237 1084.8360 1086.8574 1109.0790 1129.2772 1164.8897 1175.8384 1204.7236 1219.5469 1233.3799 1245.6109 1263.4537 1267.9853 1271.4836 1281.3161 1287.6488 1291.6544 1299.2750 1361.0922 1365.3750 1370.5082 1378.8427 1383.4668 1388.9525 1389.8175 1391.4068 1403.0958 1444.0313 1459.3146 1461.7242 1463.1940 1464.7651 1468.9598 1470.6811 1477.5342 1479.2194 1480.4033 1485.7770 1489.4257 1491.2813 1572.0970 1596.0471 1616.5414 2839.0919 2846.1259 2859.8249 2979.5333 2982.8543 2983.3296 2996.3499 3008.9731 3023.1080 3026.6768 3029.7607 3035.4654 3051.7987 3072.3051 3073.6709 3075.6819 3081.1894 3083.4470 3092.4520 3092.7453 3107.1978 3134.5354 3151.8736 3168.4032 3180.1151
redmass: 3.4587 3.4286 4.1997 5.1549 4.6901 2.8969 2.9966 3.8662 2.0406 1.8964 2.6435 3.1138 2.6906 2.4709 2.0093 3.4035 2.8543 1.3845 2.1665 1.4785 2.0116 3.2705 3.0457 3.5674 3.1993 4.9000 5.5096 3.3534 3.1720 2.9205 3.1869 5.0880 4.6499 5.0881 7.0247 3.1483 8.0890 2.9520 2.6650 1.1223 1.1958 1.1440 1.1971 1.5754 8.1539 1.2928 6.7007 1.8161 1.3821 1.4401 1.6684 6.0613 2.3702 1.3641 1.3446 3.0766 3.7246 2.3004 1.9014 2.0496 2.0114 2.4422 2.0614 2.7895 1.9351 1.7230 1.4643 1.0910 2.2764 1.6880 2.7275 1.2015 1.1749 1.2617 1.2149 1.1358 1.3681 1.2174 1.3020 1.3270 1.3405 1.4276 8.7810 1.4986 1.2292 1.2360 1.2078 2.8592 1.0986 2.3013 1.0583 1.0585 1.0451 1.0773 1.0572 1.0714 1.0482 1.0603 1.0690 1.0813 1.0734 6.8969 6.3942 11.0481 1.0718 1.0723 1.0712 1.0368 1.0359 1.0359 1.0577 1.0613 1.0587 1.0851 1.0863 1.0875 1.1047 1.0968 1.0988 1.0978 1.1024 1.1052 1.1003 1.1002 1.1045 1.0869 1.0927 1.0982 1.0929
irintensity: 1.0049 0.1947 0.3325 0.2681 0.8910 0.6526 0.2557 0.8491 0.1409 1.0862 0.7268 0.8688 1.0276 2.1629 0.8476 0.8328 2.6519 0.3408 2.0629 0.6728 1.1646 0.9679 1.7359 1.7571 8.7118 0.4631 1.1352 6.5721 0.7992 14.1685 13.6177 8.6340 1.0514 2.2905 0.8595 5.8559 23.1040 48.3964 7.1403 2.2841 10.2786 5.7042 6.1953 25.2656 10.7463 1.1589 29.5231 1.1577 2.1868 8.0266 25.1988 3.8901 12.3174 0.5665 1.3166 13.5150 309.7553 5.7045 12.9433 18.4185 28.3442 10.3033 1.6630 5.7881 39.1920 10.2853 14.0880 17.9552 35.1882 11.4255 400.3524 1.9904 4.6502 19.7743 6.9060 1.2106 18.0872 23.8246 31.9200 4.5328 5.3391 2.8394 5.1678 6.6505 20.3380 19.3900 16.2758 9.5385 10.4416 22.6268 2.8822 5.5674 10.1424 2.2376 0.8036 0.9787 6.8707 6.0593 9.6872 15.5485 12.9432 70.5883 6.6071 165.2636 43.5628 31.7069 244.9454 28.9029 37.0306 25.2798 15.2790 17.6287 24.0021 8.8338 30.7922 19.4738 1.6719 36.4115 24.6410 92.0080 1.1651 62.2152 24.8604 55.3998 34.1836 4.5450 6.7920 13.4556 1.7683
temp: 298.150 k
press: 1.00000 atm
elementType: 16 8 8 7 6 6 6 6 6 6 6 6 6 6 6 6 6 6 6 6 1 1 1 1 1 1 1 1 1 1 1 1 1 1 1 1 1 1 1 1 1 1 1 1 1
symmnumber: 1
zpe: 994967.1 jmol-1
zpe.correction: 0.378963 hartree
zpe.thermalcorrener: 0.401602 hartree
zpe.thermalcorrenthalpy: 0.402546 hartree
zpe.thermalcorrgfe: 0.323037 hartree
zpe.sumelectzpe: -1226.390803 hartree
zpe.sumelectthermal: -1226.368164 hartree
zpe.sumelectthermalent: -1226.367220 hartree
zpe.sumelectthermalfe: -1226.446729 hartree
dipole: -0.1945 -0.9631 1.0557
dipole: 1.4422
quadrupole: -100.5775 -136.3523 -130.4345
quadrupole: -2.2908 7.9591 -3.8925
quadrupole: 21.8773 -13.8975 -7.9798 -2.2908 7.9591 -3.8925
hfenergy: -1226.7697659 hartree
pointgroup: C01 [X(C16H25N1O2S1)]
dipole: -0.0683669 -0.3984596 0.3981338 debye
polarizability: 256.4956391|-10.5752027|225.1638002|-6.1363749|8.2719862|153.3680004 unknown
InChI: InChI=1S/C16H25NO2S/c1-4-17(5-2)11-8-12-19-16(18)14-9-7-10-15(13-14)20-6-3/h7,9-10,13H,4-6,8,11-12H2,1-3H3
charge 0 multiplicity 1
45 atoms
S  3.977443 -2.211367 -1.159163
O  -0.114448 1.033918 -0.055211
O  0.645112 3.209117 0.296493
N  -4.822359 -0.468422 0.029122
C  -3.90982 0.687874 0.220675
C  -2.426258 0.300565 0.021543
C  -5.083507 -0.752552 -1.409275
C  -6.07433 -0.352572 0.826061
C  -1.508935 1.51482 0.167819
C  -5.482708 -2.217305 -1.672192
C  -5.863445 -0.64627 2.323705
C  0.886982 2.00289 0.037909
C  2.246177 1.433025 -0.203603
C  2.441688 0.056072 -0.488697
C  3.35805 2.310292 -0.132631
C  3.745451 -0.434024 -0.717339
C  4.854808 0.445762 -0.660423
C  4.658678 1.812909 -0.357359
C  4.998857 -2.799394 0.342641
C  4.182315 -2.839396 1.639669
H  -4.17408 1.537776 -0.461256
H  -4.039876 1.065566 1.252005
H  -2.275411 -0.146235 -0.978763
H  -2.156952 -0.471233 0.764142
H  -5.865868 -0.065338 -1.822889
H  -4.155181 -0.538731 -1.970423
H  -6.548624 0.654611 0.698885
H  -6.794846 -1.088093 0.425162
H  -1.729236 2.303972 -0.575678
H  -1.564949 1.969416 1.174823
H  -4.689596 -2.89582 -1.313286
H  -6.422109 -2.490512 -1.157896
H  -5.633885 -2.387357 -2.754678
H  -5.449618 -1.661007 2.455339
H  -5.163784 0.06923 2.792918
H  -6.823495 -0.579393 2.869059
H  1.58138 -0.616759 -0.526242
H  3.180121 3.366648 0.093409
H  5.860735 0.065522 -0.870235
H  5.519542 2.488431 -0.313179
H  5.876015 -2.135572 0.426898
H  5.34902 -3.802202 0.041903
H  4.811083 -3.194055 2.479396
H  3.31805 -3.518994 1.542065
H  3.802114 -1.835411 1.898875
