program: Gaussian 09
title: 000049076
version: EM64L-G09RevD.01
frameworkgroup: C1[X(C17H25NO2)]
method: RPBEPBE
basis: SDD
operation: Freq
keyword: #p
keyword: freq=noraman
keyword: PBEPBE/SDD
title: #p freq=noraman PBEPBE/SDD
converged: NO YES NO NO
title: Mulliken charges:
elementType: O O N C C C C C C C C C C C C C C C C C H H H H H H H H H H H H H H H H H H H H H H H H H
charge: -0.297314 -0.259546 -0.134523 0.024671 -0.048191 -0.449394 -0.361886 -0.412443 -0.327420 -0.799085 -0.754855 -0.442502 -0.254392 0.211802 0.210003 -0.343384 -0.335321 -0.220682 -0.219609 -0.223686 0.175636 0.186864 0.192830 0.212618 0.203577 0.173056 0.216707 0.192144 0.184822 0.237036 0.243564 0.211023 0.220161 0.224446 0.203915 0.238511 0.198935 0.216658 0.226995 0.251287 0.270709 0.262162 0.232752 0.229847 0.231505
chargesum: 0.00000
title: Mulliken charges with hydrogens summed into heavy atoms:
elementType: O O N C C C C C C C C C C C C C C C C C
charge: -0.297314 -0.259546 -0.134523 0.200307 0.138673 -0.043946 0.014747 -0.003592 0.094437 -0.124337 -0.087982 -0.026909 0.223889 0.211802 0.210003 -0.072675 -0.073159 0.012070 0.010238 0.007818
polarizability: 2.30484912e+02 3.36237566e+01 1.66597596e+02 9.11832745e-01 7.99793307e+00 1.81272839e+02
1716.lowfreq: -18.8988 -10.8899 -2.5511 0.0004 0.0005 0.0007 8.0968 9.7582 22.8135
frequency: -3.8941 8.3964 22.3527 40.6627 61.6492 74.8518 101.2724 134.7320 156.5645 169.1178 180.8884 209.6260 239.9790 255.6797 261.5416 273.3349 313.9059 323.9837 339.3977 351.4313 371.6797 399.0414 404.1079 436.0545 442.1529 460.5775 478.3679 519.8419 551.9339 613.9533 626.9528 658.8659 679.6137 702.1764 703.5399 760.7109 792.2062 795.6477 811.1540 835.7565 861.0880 865.2917 872.3235 894.2431 906.4225 941.2380 953.8052 965.8782 980.1462 990.4769 995.8031 1003.2386 1008.2912 1020.3292 1029.3255 1036.0591 1059.9192 1067.7226 1082.0632 1086.9145 1090.6253 1093.8848 1121.6998 1131.4008 1153.3237 1158.4551 1173.1643 1180.2943 1196.3167 1208.1854 1229.7276 1244.9061 1257.4907 1266.4310 1282.6327 1293.6579 1305.8878 1313.4127 1337.8639 1338.8565 1345.1624 1347.8923 1356.9775 1359.3022 1369.7941 1379.4656 1385.1680 1388.1523 1389.1416 1437.4750 1453.0057 1456.4264 1459.9096 1461.6935 1464.3638 1469.9313 1476.3900 1477.4550 1483.0468 1488.8954 1498.7688 1583.5089 1610.8569 1618.4391 2798.5303 2818.3717 2855.7291 2954.4633 2972.2899 2981.5219 2984.1121 2990.7134 2993.6181 3015.5715 3025.7369 3036.2995 3045.7856 3052.0387 3067.8455 3072.1324 3084.5758 3086.1234 3087.2358 3088.5124 3128.7833 3141.2370 3154.3992 3166.0336 3176.6461
redmass: 4.5360 4.5098 3.4252 4.2581 4.8022 4.0945 5.2307 2.8050 2.4593 1.9841 1.9320 3.0612 1.5640 1.9523 4.1073 1.6992 2.0295 2.9749 2.8878 3.0881 1.9016 2.7573 2.8290 2.7301 3.6581 3.4281 3.2843 3.0126 2.2665 6.4411 2.2968 6.8495 5.0012 1.6404 2.4385 2.1038 2.5848 2.3085 3.6581 2.3090 1.5417 1.2460 2.5795 2.1772 2.6252 1.7537 1.4214 1.6318 1.6885 6.1870 1.3842 1.5112 1.3280 2.6505 1.6154 1.9073 2.6596 1.8257 2.1608 1.9191 2.0406 2.1668 2.1464 1.4547 2.2278 2.3132 1.0569 1.1284 1.4292 1.1850 1.6008 3.0628 1.6495 1.2566 1.1814 1.2792 1.4419 1.3216 1.3995 1.4692 1.4314 1.3719 1.4857 1.4935 1.3482 1.3395 1.3126 1.2545 7.9331 2.2403 1.0884 1.0787 1.0722 1.0837 1.0865 1.0687 1.1183 2.1328 1.0551 1.0545 1.0564 6.9891 6.2497 9.6715 1.0805 1.0713 1.0720 1.0678 1.0733 1.0384 1.0385 1.0621 1.0603 1.0591 1.0976 1.0873 1.0976 1.1021 1.0988 1.0982 1.0979 1.1057 1.0991 1.0913 1.0854 1.0891 1.0938 1.0974 1.0981
irintensity: 0.1053 0.4589 0.0922 0.4211 1.1577 0.4363 0.0301 1.5267 1.0291 0.8004 0.2600 5.6351 1.9415 3.2127 9.7501 0.3881 2.5390 0.3939 4.3248 5.5256 1.2988 6.7935 0.0344 0.7578 0.2744 1.1220 0.4794 1.2787 1.0852 0.4159 3.3159 6.1613 17.0161 95.2893 7.6411 4.9666 4.3606 18.7912 1.0947 3.0929 8.2169 0.1011 15.5078 5.9559 18.2741 3.0450 4.4152 4.3697 1.2731 0.7259 0.0373 8.1286 0.6028 59.8379 2.5158 10.3272 175.8561 47.9492 27.6314 36.2301 22.1101 12.4481 22.7492 4.4678 13.8519 13.2591 0.1208 45.4428 7.1111 22.9715 51.4237 291.3363 16.4704 11.7415 4.5231 0.7435 3.7084 2.0580 0.8136 8.5405 2.3817 1.1581 0.0286 4.9513 8.3770 8.2930 19.8685 14.2104 2.5639 13.9871 9.3675 9.0891 11.2432 10.2346 20.5670 14.0406 7.4712 3.3379 2.2025 20.6664 6.8974 46.1505 11.3846 142.5539 63.0785 116.4283 160.2278 16.9778 83.4543 20.1255 38.2621 31.4792 27.8325 22.4450 53.6305 44.5772 29.1363 58.9358 49.3322 24.5050 42.7966 31.2579 19.5356 32.6116 0.1830 11.6244 16.6674 22.6836 9.1699
temp: 298.150 k
press: 1.00000 atm
elementType: 8 8 7 6 6 6 6 6 6 6 6 6 6 6 6 6 6 6 6 6 1 1 1 1 1 1 1 1 1 1 1 1 1 1 1 1 1 1 1 1 1 1 1 1 1
symmnumber: 1
zpe: 1017436.1 jmol-1
zpe.correction: 0.387521 hartree
zpe.thermalcorrener: 0.406697 hartree
zpe.thermalcorrenthalpy: 0.407641 hartree
zpe.thermalcorrgfe: 0.337941 hartree
zpe.sumelectzpe: -866.465311 hartree
zpe.sumelectthermal: -866.446136 hartree
zpe.sumelectthermalent: -866.445192 hartree
zpe.sumelectthermalfe: -866.514891 hartree
dipole: 0.7603 -0.7948 -2.6935
dipole: 2.9094
quadrupole: -107.6894 -118.7318 -122.8603
quadrupole: 8.8579 2.8039 -1.8665
quadrupole: 8.7378 -2.3046 -6.4332 8.8579 2.8039 -1.8665
hfenergy: -866.8528322 hartree
pointgroup: C01 [X(C17H25N1O2)]
dipole: 0.3415808 0.4971906 0.9727984 debye
polarizability: 228.2668135|-35.0219206|172.5890971|4.6030459|10.8253448|177.4994366 unknown
InChI: InChI=1S/C17H25NO2/c1-14-8-6-11-18(15(14)2)12-7-13-20-17(19)16-9-4-3-5-10-16/h3-5,9-10,14-15H,6-8,11-13H2,1-2H3
charge 0 multiplicity 1
45 atoms
O  -1.000032 -1.213167 0.46161
O  -1.877719 -1.646586 -1.653168
N  2.561374 -0.30215 0.587474
C  2.79356 1.180369 0.578365
C  3.525226 1.591143 -0.741694
C  4.866084 0.819037 -0.856223
C  3.853382 -1.039061 0.524492
C  4.640969 -0.703914 -0.754902
C  1.705525 -0.802996 1.692968
C  1.492552 1.991879 0.76165
C  2.64052 1.410507 -1.998379
C  1.045641 -2.165268 1.368426
C  0.150949 -2.110783 0.131948
C  -1.954233 -1.057003 -0.54524
C  -3.051477 -0.124894 -0.147778
C  -4.095819 0.104924 -1.080845
C  -3.073356 0.526876 1.112711
C  -5.153402 0.978897 -0.756541
C  -4.133652 1.401397 1.432858
C  -5.174343 1.628905 0.500869
H  3.489658 1.450113 1.420269
H  3.764452 2.67101 -0.640343
H  5.538301 1.13725 -0.03158
H  5.374898 1.077164 -1.805088
H  3.647474 -2.123931 0.560524
H  4.486944 -0.795375 1.420052
H  4.078139 -1.067889 -1.634513
H  5.610676 -1.238437 -0.739247
H  2.278187 -0.895401 2.651024
H  0.893334 -0.081099 1.867529
H  0.683702 1.59592 0.122214
H  1.137441 1.998497 1.807188
H  1.673597 3.043833 0.474015
H  1.784185 2.108485 -1.996608
H  3.22677 1.604495 -2.91623
H  2.235346 0.385402 -2.053235
H  1.813102 -2.944508 1.195285
H  0.451922 -2.492903 2.243593
H  -0.251571 -3.101082 -0.146682
H  0.68951 -1.67759 -0.728801
H  -4.055609 -0.409392 -2.046762
H  -2.263602 0.3401 1.823693
H  -5.958374 1.154538 -1.478351
H  -4.150725 1.905126 2.405525
H  -5.996304 2.30856 0.752728
