program: Gaussian 09
title: 000049090
version: EM64L-G09RevD.01
frameworkgroup: C1[X(C15H23NO2S)]
method: RPBEPBE
basis: SDD
operation: Freq
keyword: #p
keyword: freq=noraman
keyword: PBEPBE/SDD
title: #p freq=noraman PBEPBE/SDD
converged: YES YES NO NO
title: Mulliken charges:
elementType: S O O N C C C C C C C C C C C C C C C H H H H H H H H H H H H H H H H H H H H H H H
charge: 0.175050 -0.280573 -0.259077 -0.097404 -0.385723 -0.327658 -0.326362 -0.300045 -0.672382 -0.696045 0.197268 0.226785 -0.368537 -0.177457 -0.344808 -0.215557 -0.208049 -0.592642 -0.646531 0.218538 0.242929 0.207309 0.184387 0.184916 0.204471 0.251087 0.226587 0.210523 0.225718 0.208547 0.252986 0.217360 0.205284 0.294369 0.274116 0.253282 0.233480 0.254132 0.264848 0.223035 0.232383 0.229464
chargesum: 0.00000
title: Mulliken charges with hydrogens summed into heavy atoms:
elementType: S O O N C C C C C C C C C C C C C C C
charge: 0.175050 -0.280573 -0.259077 -0.097404 0.075744 0.064037 0.063025 0.177629 -0.027595 -0.020416 0.197268 0.226785 -0.074168 -0.177457 -0.070692 0.037724 0.025430 -0.073662 0.038350
polarizability: 2.88822210e+02 1.35497202e+01 1.90415808e+02 -9.89200093e+00 9.35897718e+00 1.35996086e+02
1716.lowfreq: -2.7914 -0.0018 -0.0015 0.0005 2.2450 4.8442 14.0702 15.9793 26.6122
frequency: 13.7392 14.9844 26.5610 32.8074 41.6245 49.4636 70.4983 74.0172 89.5273 106.7533 129.0051 144.3318 159.2980 204.9324 218.6312 235.9741 239.2015 255.8311 269.6114 276.9280 289.0605 308.7035 346.1761 382.0262 402.1072 415.3379 428.5428 454.2428 479.5539 514.2644 527.4386 616.1463 648.7601 684.8916 701.5869 724.3263 750.0483 766.7794 785.4528 798.4223 801.1797 808.8782 815.8192 904.0360 918.2700 938.0203 955.9617 986.5755 989.0788 994.0326 997.0380 1028.7829 1050.5552 1064.4126 1067.6655 1070.5629 1074.1288 1075.7026 1083.9581 1091.3625 1093.6542 1124.7467 1175.8624 1184.6039 1211.4701 1233.3657 1236.2620 1249.6422 1273.3391 1283.6545 1285.6044 1287.1392 1312.7949 1325.1221 1361.5139 1364.6387 1378.9205 1383.2954 1388.8882 1394.3138 1395.2253 1407.9691 1445.7249 1455.9964 1459.2814 1464.3258 1466.0666 1469.1757 1471.7419 1477.0194 1483.7529 1485.0659 1490.7093 1497.7859 1571.2164 1596.0476 1613.0625 2845.3671 2854.4823 2968.1679 2980.3560 2984.9132 2985.9668 3018.2492 3023.5003 3029.3659 3037.1130 3048.7333 3076.7001 3078.5303 3079.3855 3080.7525 3086.4252 3091.8960 3107.6790 3129.8347 3135.4072 3155.5352 3164.1751 3180.5027
redmass: 3.6611 3.6510 3.9230 5.4887 3.4626 1.9898 2.2638 4.4848 4.4595 2.2388 3.0996 2.7347 5.0164 3.2926 4.1881 1.1058 1.3466 1.9969 2.0387 2.7836 2.4005 2.7966 5.7301 2.7699 4.7680 6.8504 3.4284 2.7450 3.8441 5.5113 4.1137 4.5600 6.5567 3.1761 5.3203 3.1212 2.6645 1.7413 1.1091 1.1891 1.7701 1.4689 1.5685 7.3145 1.9341 1.3761 1.4349 5.8035 2.2761 1.8055 1.3701 1.1944 3.9247 2.7956 2.1340 2.6119 2.3571 2.0545 2.8179 1.7564 1.5575 1.7026 1.1088 1.6423 2.4047 2.5607 1.3420 1.4015 1.2654 1.3174 1.1710 1.1956 1.2690 1.2851 1.3007 1.3393 9.1312 1.3120 1.2637 1.2296 1.2069 2.9900 1.1376 2.0227 1.1289 1.0535 1.0575 1.0405 1.0635 1.0796 1.0478 1.0616 1.0615 1.0626 6.8644 6.4411 9.7731 1.0719 1.0711 1.0584 1.0356 1.0357 1.0354 1.0915 1.0574 1.1000 1.0879 1.0575 1.0989 1.0982 1.1028 1.0986 1.1007 1.1006 1.1069 1.1102 1.0872 1.0948 1.0925 1.0963
irintensity: 1.3231 0.0108 1.1292 1.3257 0.1967 0.1819 0.0885 1.2093 0.1014 0.4129 0.1505 1.4108 0.6353 0.9291 0.2644 0.0991 1.3721 0.1337 5.2752 1.3791 3.1966 10.0887 11.5082 10.0922 1.7128 0.4528 0.7960 0.9455 6.0231 11.5771 9.9328 5.8831 1.2158 6.5262 11.2124 50.4444 2.1642 21.1285 8.2716 6.9056 10.7343 2.1758 24.1168 106.4183 5.0023 0.5189 8.6640 1.6874 3.8738 23.7545 0.1943 0.7852 64.6584 43.9339 29.0702 84.2704 7.7734 128.7464 7.2115 14.4268 4.1265 9.7522 25.6106 4.9557 62.0774 343.5781 49.6195 18.8914 18.0362 20.9894 5.4758 12.8345 6.1393 22.4546 20.8835 3.0152 5.9265 5.5610 20.2986 14.9032 20.8447 35.1906 15.4810 1.0727 7.8878 6.9357 1.5179 14.5555 3.1178 4.8330 8.3158 19.1816 12.3492 11.5482 44.8601 0.2552 142.9738 37.5590 198.5637 33.8003 25.0637 35.8236 34.9857 7.4871 17.3811 27.7955 31.2404 32.1975 28.1938 67.8456 3.3209 26.2814 35.4261 44.8466 39.5678 12.3649 5.4412 12.5700 1.9406 6.3099
temp: 298.150 k
press: 1.00000 atm
elementType: 16 8 8 7 6 6 6 6 6 6 6 6 6 6 6 6 6 6 6 1 1 1 1 1 1 1 1 1 1 1 1 1 1 1 1 1 1 1 1 1 1 1
symmnumber: 1
zpe: 923132.2 jmol-1
zpe.correction: 0.351602 hartree
zpe.thermalcorrener: 0.373686 hartree
zpe.thermalcorrenthalpy: 0.374631 hartree
zpe.thermalcorrgfe: 0.295649 hartree
zpe.sumelectzpe: -1187.167452 hartree
zpe.sumelectthermal: -1187.145368 hartree
zpe.sumelectthermalent: -1187.144424 hartree
zpe.sumelectthermalfe: -1187.223406 hartree
dipole: 0.3397 1.7007 3.2583
dipole: 3.6911
quadrupole: -105.1205 -117.3772 -124.6075
quadrupole: -1.3950 -6.7986 -1.4416
quadrupole: 10.5812 -1.6755 -8.9057 -1.3950 -6.7986 -1.4416
hfenergy: -1187.5190548 hartree
pointgroup: C01 [X(C15H23N1O2S1)]
dipole: 0.0850401 -0.7271541 -1.2541214 debye
polarizability: 287.993015|-16.6992096|192.2521722|8.1680877|6.9070181|134.988917 unknown
InChI: InChI=1S/C15H23NO2S/c1-4-16(5-2)10-11-18-15(17)13-8-7-9-14(12-13)19-6-3/h7-9,12H,4-6,10-11H2,1-3H3
charge 0 multiplicity 1
42 atoms
S  -5.034836 1.121406 0.691563
O  1.077211 -1.118489 0.51307
O  0.441526 1.08978 0.926406
N  4.497717 0.2555 -0.408935
C  3.078932 -0.119334 -0.618162
C  5.46625 -0.527736 -1.218828
C  4.736819 1.72157 -0.415272
C  2.508321 -0.714409 0.685607
C  6.874605 -0.587978 -0.594861
C  4.051937 2.451739 0.756394
C  0.132445 -0.100057 0.658607
C  -1.262864 -0.596929 0.467553
C  -2.323712 0.335416 0.611747
C  -3.65935 -0.085517 0.44523
C  -1.54295 -1.949335 0.145119
C  -3.940193 -1.439617 0.135501
C  -2.881633 -2.363876 -0.022034
C  -5.626757 1.304591 -1.117408
C  -6.832716 2.252675 -1.150495
H  2.978558 -0.864234 -1.432381
H  2.470923 0.760534 -0.907477
H  5.075471 -1.559969 -1.292999
H  5.539927 -0.138545 -2.266932
H  4.403191 2.178845 -1.382474
H  5.827161 1.885823 -0.345705
H  2.581373 0.019402 1.504697
H  3.023921 -1.647998 0.958307
H  7.355681 0.405567 -0.553807
H  6.815924 -0.98243 0.434715
H  7.529144 -1.24908 -1.19299
H  2.953486 2.33209 0.737625
H  4.425233 2.062482 1.720516
H  4.271918 3.534554 0.707837
H  -2.087864 1.376739 0.852065
H  -0.715257 -2.655129 0.036123
H  -4.980855 -1.767269 0.036074
H  -3.105384 -3.408854 -0.261976
H  -5.887848 0.298633 -1.486641
H  -4.778639 1.697125 -1.702268
H  -7.186414 2.376735 -2.190725
H  -6.567929 3.251273 -0.759834
H  -7.670375 1.857706 -0.548551
