program: Gaussian 09
title: 000049069
version: EM64L-G09RevD.01
frameworkgroup: C1[X(C17H25NO3)]
method: RPBEPBE
basis: SDD
operation: Freq
keyword: #p
keyword: freq=noraman
keyword: PBEPBE/SDD
title: #p freq=noraman PBEPBE/SDD
converged: YES YES NO NO
title: Mulliken charges:
elementType: O O O N C C C C C C C C C C C C C C C C C H H H H H H H H H H H H H H H H H H H H H H H H H
charge: -0.308166 -0.222890 -0.387219 -0.133139 0.026624 -0.048000 -0.448674 -0.362548 -0.412880 -0.326116 -0.803463 -0.754415 -0.440477 -0.249048 0.212251 0.109654 0.183230 -0.287416 -0.395411 -0.254018 -0.195244 0.175110 0.185789 0.192628 0.211889 0.204517 0.172083 0.216758 0.191821 0.184313 0.232791 0.244485 0.209734 0.220456 0.224045 0.203334 0.239607 0.196640 0.216123 0.225991 0.247257 0.264151 0.219031 0.232834 0.231110 0.354866
chargesum: 0.00000
title: Mulliken charges with hydrogens summed into heavy atoms:
elementType: O O O N C C C C C C C C C C C C C C C C C
charge: -0.308166 -0.222890 -0.032353 -0.133139 0.201734 0.137790 -0.044158 0.014051 -0.004301 0.090988 -0.128787 -0.087429 -0.027714 0.224201 0.212251 0.109654 0.183230 -0.023265 -0.176381 -0.021183 0.035866
polarizability: 2.41793974e+02 2.40286391e+01 1.88694372e+02 1.21401214e+01 -1.98783809e+01 1.69081386e+02
1716.lowfreq: -17.4922 -7.5795 -1.9247 -0.0007 -0.0006 -0.0005 9.0991 9.8240 20.1737
frequency: 4.1987 7.5095 20.0586 32.3374 50.7207 74.3183 88.9696 129.3259 147.9608 160.2740 181.2856 194.6761 244.5343 247.3278 253.6344 264.3882 286.1279 297.7286 319.4780 334.5543 352.0434 370.1649 378.2164 390.4095 409.3580 435.8863 438.2587 469.2526 485.3120 516.2243 525.1673 549.6010 555.6061 623.3132 648.1227 673.6464 703.4482 754.3304 758.0691 765.7545 772.9127 793.6720 829.1518 838.1900 849.4112 861.4965 876.4579 892.4085 906.4772 942.7270 953.7023 966.4382 979.9257 985.0515 1003.1624 1019.4253 1030.1789 1036.8759 1041.8542 1067.9451 1080.6635 1090.8723 1092.4436 1098.9550 1120.9794 1131.8551 1151.2227 1157.5665 1158.1654 1174.1804 1195.8813 1208.2475 1222.4920 1231.8246 1252.7904 1256.7211 1265.9232 1282.0684 1292.1190 1294.5037 1307.1082 1335.5893 1339.1338 1341.8702 1347.5495 1356.2695 1358.9770 1371.3040 1378.6934 1385.9830 1387.8363 1394.4563 1428.9932 1450.9775 1457.8774 1462.0676 1463.6023 1465.5145 1471.3554 1476.7638 1484.7154 1489.0256 1489.4653 1501.0177 1593.5834 1607.6165 1631.6196 2796.9765 2815.7089 2854.9734 2954.1960 2971.7069 2981.0075 2983.8657 2991.6849 2994.1013 3014.3539 3025.1450 3035.8702 3046.5360 3052.9483 3067.8124 3072.4414 3083.2752 3084.9280 3086.0874 3096.4514 3111.6769 3142.1908 3161.8406 3183.2339 3550.8676
redmass: 4.5671 4.9836 3.4106 7.8548 4.1876 4.3707 4.3431 3.2594 3.2825 3.5159 1.8782 1.5680 2.3740 2.3918 2.3997 3.2724 1.5847 4.4021 1.9895 2.2649 3.0239 1.9237 3.3031 1.3581 2.6967 3.3494 2.6098 2.8542 3.4310 3.0736 3.6924 2.7896 4.1625 2.3088 6.3424 4.4680 2.5028 2.3879 2.0192 2.0536 4.9563 2.4984 3.6117 2.3578 1.4980 1.5427 2.7703 2.1820 2.7246 1.7523 1.3648 1.6012 1.7295 1.3352 1.5900 4.4492 1.7393 1.9227 2.1960 1.7832 2.2584 2.0933 2.1176 2.0675 2.1057 1.4614 2.2852 2.1856 1.2675 1.0628 1.4064 1.1995 2.6878 1.7734 2.8750 1.5503 1.2548 1.1864 1.2754 1.4469 1.4243 1.4765 1.4597 1.4236 1.3482 1.4789 1.5045 1.3297 1.3749 1.2771 1.2139 6.8624 2.3509 1.0893 1.0789 1.0779 1.0727 1.0832 1.0776 1.0794 1.0532 1.1024 2.3206 1.0570 6.7610 6.6829 10.5361 1.0805 1.0715 1.0724 1.0684 1.0727 1.0386 1.0379 1.0626 1.0602 1.0590 1.0977 1.0872 1.0977 1.1018 1.0989 1.0985 1.1074 1.0997 1.0993 1.0861 1.0888 1.0893 1.0952 1.0968 1.0658
irintensity: 0.1739 0.1568 0.0710 2.6323 0.1652 1.3525 1.1969 1.2034 0.2088 3.2441 1.5958 5.0700 1.8790 0.5179 2.1049 3.8386 0.2300 6.5269 1.4724 4.8379 6.7934 1.1763 24.0760 101.8441 2.5396 5.6595 0.9420 4.3135 8.8977 3.8271 12.3728 2.9065 4.4006 3.4011 8.6004 20.5217 12.1990 52.9525 12.9763 30.3890 4.1642 2.9943 26.1178 1.3504 0.3714 8.7887 7.7084 8.3370 18.0869 1.9514 1.6322 4.4890 5.7411 0.2623 36.2814 262.9870 39.1330 12.3760 7.0763 33.4198 29.6725 10.5798 13.4223 124.5071 24.7923 3.8107 15.1118 20.9618 44.2076 10.1648 13.0023 33.8037 289.4378 56.5340 11.4485 0.9549 9.4995 6.7117 1.6421 55.1869 4.5247 0.4971 7.7303 2.3123 1.1713 0.1147 5.1834 7.0529 6.1699 21.0946 15.3383 10.6772 26.0744 9.1047 7.3514 17.6148 5.6983 23.3857 11.7009 5.0742 5.4070 12.8184 31.1771 6.1886 23.1387 31.5523 230.6711 61.9349 120.8352 161.7457 16.3805 85.3639 22.4279 36.9582 33.6888 28.6323 20.1546 53.5995 43.7797 32.0576 58.4742 53.8322 23.0075 32.2468 39.7171 24.1148 33.7032 13.5846 10.1152 17.9154 8.3217 28.6860
temp: 298.150 k
press: 1.00000 atm
elementType: 8 8 8 7 6 6 6 6 6 6 6 6 6 6 6 6 6 6 6 6 6 1 1 1 1 1 1 1 1 1 1 1 1 1 1 1 1 1 1 1 1 1 1 1 1 1
symmnumber: 1
zpe: 1025722.3 jmol-1
zpe.correction: 0.390677 hartree
zpe.thermalcorrener: 0.412019 hartree
zpe.thermalcorrenthalpy: 0.412963 hartree
zpe.thermalcorrgfe: 0.335776 hartree
zpe.sumelectzpe: -941.597060 hartree
zpe.sumelectthermal: -941.575718 hartree
zpe.sumelectthermalent: -941.574774 hartree
zpe.sumelectthermalfe: -941.651961 hartree
dipole: 0.7221 2.2390 -1.9241
dipole: 3.0393
quadrupole: -96.9689 -125.6938 -128.5273
quadrupole: 9.4669 4.1879 2.3523
quadrupole: 20.0944 -8.6304 -11.4640 9.4669 4.1879 2.3523
hfenergy: -941.9877367 hartree
pointgroup: C01 [X(C17H25N1O3)]
dipole: 0.2594741 -0.8927687 0.751944 debye
polarizability: 240.5032243|-25.3123488|190.253952|-12.730196|-19.4503359|168.8125551 unknown
InChI: InChI=1S/C17H25NO3/c1-13-7-5-10-18(14(13)2)11-6-12-21-17(20)15-8-3-4-9-16(15)19/h3-4,8-9,13-14,19H,5-7,10-12H2,1-2H3
charge 0 multiplicity 1
46 atoms
O  0.816364 1.100277 0.626332
O  1.815196 1.849251 -1.34016
O  4.460009 1.035438 -1.573266
N  -2.772367 0.266457 0.61075
C  -3.032072 -1.201816 0.44847
C  -3.749234 -1.45978 -0.917077
C  -5.075294 -0.654942 -0.970166
C  -4.049877 1.028812 0.613036
C  -4.828067 0.84522 -0.703151
C  -1.92112 0.638826 1.769905
C  -1.75032 -2.054846 0.568008
C  -2.841305 -1.164603 -2.134816
C  -1.224404 2.008793 1.584413
C  -0.30539 2.050906 0.364492
C  1.834367 1.084867 -0.348042
C  2.862722 0.053158 -0.019878
C  4.140089 0.030699 -0.658466
C  2.573545 -0.96288 0.93284
C  5.075518 -0.98978 -0.345727
C  3.499425 -1.97724 1.241218
C  4.75785 -1.988819 0.594099
H  -3.747296 -1.541542 1.24813
H  -4.008539 -2.53982 -0.932958
H  -5.767539 -1.047139 -0.195365
H  -5.570568 -0.801484 -1.949535
H  -3.825833 2.099706 0.766258
H  -4.698796 0.70398 1.471338
H  -4.248554 1.291961 -1.532331
H  -5.789776 1.390749 -0.640936
H  -2.506422 0.653773 2.724777
H  -1.128608 -0.115448 1.888074
H  -0.922984 -1.611679 -0.014365
H  -1.416119 -2.175545 1.613609
H  -1.946695 -3.067408 0.170403
H  -1.990325 -1.867335 -2.187693
H  -3.412888 -1.261346 -3.077055
H  -2.427388 -0.142981 -2.080408
H  -1.971433 2.818682 1.472505
H  -0.640136 2.238627 2.496353
H  0.121294 3.054684 0.189671
H  -0.837867 1.717849 -0.543895
H  1.597373 -0.934154 1.423502
H  6.05475 -0.994837 -0.842916
H  3.246214 -2.74954 1.974006
H  5.490593 -2.77098 0.820644
H  5.378204 0.902131 -1.922228
