program: Gaussian 09
title: 000049014
version: EM64L-G09RevD.01
frameworkgroup: C1[X(C15H17I3N2O4)]
method: RPBEPBE
basis: SDD
operation: Freq
keyword: #p
keyword: freq=noraman
keyword: PBEPBE/SDD
title: #p freq=noraman PBEPBE/SDD
converged: YES YES NO NO
title: Mulliken charges:
elementType: I I I O O O O N N C C C C C C C C C C C C C C C H H H H H H H H H H H H H H H H H
charge: 0.144577 0.161547 0.176627 -0.201226 -0.202779 -0.361329 -0.179275 -0.518545 -0.519312 0.833248 0.826235 -0.761592 -0.506342 -0.505770 0.702993 -0.801155 -0.761488 -0.345512 -0.345602 0.217676 0.222552 -0.684493 -0.684046 -0.030561 0.240615 0.208717 0.208845 0.241093 0.212180 0.244789 0.211245 0.245128 0.316053 0.319152 0.206504 0.225115 0.209534 0.206921 0.225417 0.209433 0.392831
chargesum: 0.00000
title: Mulliken charges with hydrogens summed into heavy atoms:
elementType: I I I O O O O N N C C C C C C C C C C C C C C C
charge: 0.144577 0.161547 0.176627 -0.201226 -0.202779 0.031502 -0.179275 -0.202492 -0.200160 0.833248 0.826235 -0.761592 -0.057010 -0.055832 0.702993 -0.801155 -0.761488 0.111457 0.110772 0.217676 0.222552 -0.043340 -0.042275 -0.030561
polarizability: 3.57801839e+02 -5.54701680e-01 3.15462525e+02 6.52327458e-02 -1.07204865e+01 1.60532426e+02
1716.lowfreq: -6.4000 -4.5291 -1.2864 -0.0003 -0.0003 -0.0001 12.4266 17.6281 19.4493
frequency: 12.2632 17.4721 19.4321 23.7692 40.1911 46.0427 51.1612 55.2734 60.9452 71.1569 75.2780 80.9865 95.3567 96.8245 100.9815 107.6354 125.6120 145.5196 163.2225 164.8357 169.8341 210.7722 221.2820 228.2333 235.5261 250.5163 261.2300 304.7653 314.2523 337.0058 350.7107 360.1553 396.9532 417.5168 471.5423 506.9945 524.7217 546.2127 556.0329 567.0228 604.8469 621.7759 626.5849 643.8888 651.1143 663.1520 722.0137 738.7085 741.3130 757.2717 759.7498 803.1970 864.8868 866.5421 890.5327 894.6738 916.3708 935.1866 952.1827 1020.3533 1030.5992 1056.6663 1057.0203 1058.2422 1083.3585 1091.4535 1107.7450 1113.5207 1170.0514 1174.5467 1226.5931 1227.3750 1249.5155 1275.7704 1276.7713 1302.2141 1306.8814 1310.7939 1338.1645 1352.3211 1353.1206 1361.1168 1365.8616 1392.8420 1393.1893 1439.5160 1442.5215 1443.1156 1445.3809 1474.7151 1476.2683 1478.1208 1478.8977 1485.6586 1487.3570 1531.8284 1534.4852 1641.1438 1643.8498 1646.9023 2964.5213 2966.8022 2972.8334 2973.2719 2997.0622 2997.2094 3016.9344 3018.8767 3049.3897 3049.7911 3076.8216 3077.2109 3077.9792 3078.1857 3502.2423 3511.5319 3515.9061
redmass: 3.7205 4.9892 7.8370 4.9530 9.2539 3.5877 3.8574 10.0091 3.0840 2.3663 4.2669 4.3452 5.5670 7.0209 14.2548 5.6578 9.6801 6.3949 45.0957 4.7926 5.0450 8.0492 2.3952 1.2685 1.3448 4.8336 5.2715 6.5324 6.3711 4.0847 3.5807 6.1439 4.2114 9.5667 3.2006 1.6293 1.9917 1.6548 3.4794 3.0418 3.5470 3.2494 4.1775 4.0413 6.6902 6.0650 7.0298 1.4227 1.4244 2.9722 3.4824 7.2260 1.4143 1.3876 2.4404 2.0505 4.4712 5.3580 4.7301 9.7979 3.7560 2.4950 2.5021 2.7514 1.5903 1.7014 2.2882 2.4457 2.2799 2.2479 1.3449 1.3500 2.4368 1.2372 1.2346 2.3976 1.2985 2.0814 4.7128 1.7441 1.6309 4.1688 6.2490 1.2141 1.2155 1.9454 1.1874 1.1691 1.6353 1.0473 1.0462 1.0453 1.0432 1.0805 1.0837 9.8635 7.7320 6.9571 6.9203 10.1149 1.0586 1.0586 1.0367 1.0366 1.0648 1.0652 1.0970 1.0972 1.0996 1.0996 1.0993 1.0990 1.1014 1.1017 1.0639 1.0764 1.0765
irintensity: 0.0497 0.4204 0.4282 0.2429 2.1650 3.2877 2.7686 1.8523 0.8195 0.8368 1.7562 0.2750 1.8589 1.5192 0.2020 2.9811 0.0959 5.9287 0.4208 2.3027 0.9741 2.4477 9.8843 1.7539 3.0338 2.7454 3.5756 2.3945 4.0096 0.8470 1.5036 1.4795 2.8668 3.3312 21.0890 50.8513 75.1724 92.1575 21.6593 7.6462 26.2960 30.2118 6.6978 62.8927 40.9835 10.6285 9.6991 12.4072 6.5618 24.4373 16.3608 10.0211 3.4261 2.3505 24.8025 24.3462 2.6606 6.1397 5.0630 27.3745 38.2711 143.7069 6.8961 101.4206 58.4663 3.6446 6.0638 11.2329 87.1699 153.4081 5.8952 8.0033 19.0150 22.7856 17.9742 19.3506 8.3475 26.8626 14.3418 5.6835 4.9202 122.7106 301.5314 9.6166 10.3929 327.0628 98.6323 58.3302 208.6961 4.1486 3.6116 12.6411 12.5909 16.3193 16.6461 10.9321 25.4663 31.6604 197.4205 213.5742 16.0194 15.3857 44.6464 40.6328 19.4840 23.4590 12.1810 12.5010 2.0367 1.6847 44.8365 42.5211 59.9826 62.2008 42.2826 21.8913 21.7726
temp: 298.150 k
press: 1.00000 atm
elementType: 53 53 53 8 8 8 8 7 7 6 6 6 6 6 6 6 6 6 6 6 6 6 6 6 1 1 1 1 1 1 1 1 1 1 1 1 1 1 1 1 1
symmnumber: 1
zpe: 781350.8 jmol-1
zpe.correction: 0.297601 hartree
zpe.thermalcorrener: 0.325788 hartree
zpe.thermalcorrenthalpy: 0.326732 hartree
zpe.thermalcorrgfe: 0.230483 hartree
zpe.sumelectzpe: -1024.935521 hartree
zpe.sumelectthermal: -1024.907334 hartree
zpe.sumelectthermalent: -1024.906389 hartree
zpe.sumelectthermalfe: -1025.002639 hartree
dipole: 1.2852 1.4701 -4.0369
dipole: 4.4844
quadrupole: -154.3848 -173.8641 -195.0811
quadrupole: -4.3910 1.8384 -16.6638
quadrupole: 20.0585 0.5793 -20.6378 -4.3910 1.8384 -16.6638
hfenergy: -1025.2331219 hartree
pointgroup: C01 [X(C15H17I3N2O4)]
dipole: 0.5073321 -0.3544478 1.6521732 debye
polarizability: 357.7106235|-1.8624838|308.8290049|-3.4263766|-33.1834423|167.2571617 unknown
InChI: InChI=1S/C15H17I3N2O4/c1-3-5-7(21)19-13-10(16)9(15(23)24)11(17)14(12(13)18)20-8(22)6-4-2/h19-20,23H,3-6H2,1-2H3
charge 0 multiplicity 1
41 atoms
I  0.026434 -2.372271 1.738043
I  3.086319 2.619739 -0.183025
I  -3.045186 2.71537 0.193852
O  -3.173966 -0.405263 -1.302994
O  2.306067 -1.944363 -0.842001
O  -0.143562 3.922931 -1.692653
O  0.135037 4.720774 0.475631
N  -2.43636 -0.441384 0.916218
N  2.516992 -0.388042 0.889928
C  -1.217039 0.258066 0.700089
C  1.270097 0.268063 0.68869
C  0.032376 -0.385838 0.931299
C  -4.572692 -1.552725 0.36473
C  4.373348 -1.967503 0.494692
C  0.009889 2.30512 0.062175
C  1.231807 1.618225 0.241858
C  -1.2081 1.623445 0.301906
C  -5.015639 -2.619962 -0.663074
C  5.218061 -2.393888 -0.728456
C  -3.350166 -0.765087 -0.110083
C  2.989397 -1.452757 0.093568
C  -6.351828 -3.284213 -0.273235
C  6.530828 -3.089559 -0.315068
C  0.008124 3.766169 -0.318506
H  -5.396722 -0.82253 0.505367
H  -4.391197 -2.018703 1.353908
H  4.919809 -1.216016 1.09922
H  4.21632 -2.849062 1.150493
H  -4.223774 -3.38822 -0.757319
H  -5.098259 -2.133999 -1.651892
H  5.439865 -1.503232 -1.347781
H  4.604357 -3.065113 -1.355792
H  -2.553548 -0.914398 1.816223
H  3.187492 0.057827 1.52147
H  -6.284685 -3.784337 0.711687
H  -6.64566 -4.046374 -1.017253
H  -7.166335 -2.537248 -0.217072
H  7.165265 -2.426453 0.303356
H  7.118746 -3.383565 -1.203125
H  6.327774 -4.005253 0.272222
H  -0.153188 4.89313 -1.921494
