program: Gaussian 09
title: 000004989
version: EM64L-G09RevD.01
frameworkgroup: C1[X(C11H14N2S)]
method: RPBEPBE
basis: SDD
operation: Freq
keyword: #p
keyword: freq=noraman
keyword: PBEPBE/SDD
title: #p freq=noraman PBEPBE/SDD
converged: YES YES NO NO
title: Mulliken charges:
elementType: S N N C C C C C C C C C C C H H H H H H H H H H H H H H
charge: 0.242821 -0.176997 -0.108065 -0.362898 -0.432906 -0.478133 0.224268 -0.660516 -0.288447 -0.168178 -0.099057 -0.304020 -0.133717 -0.524673 0.213704 0.220526 0.207208 0.226538 0.227446 0.200019 0.233644 0.246151 0.226373 0.228442 0.286786 0.245355 0.243201 0.265126
chargesum: 0.00000
title: Mulliken charges with hydrogens summed into heavy atoms:
elementType: S N N C C C C C C C C C C C
charge: 0.242821 -0.176997 -0.108065 0.071331 0.000840 -0.050668 0.224268 0.045652 -0.060005 0.118608 -0.099057 -0.058665 0.109483 -0.259547
polarizability: 2.82020674e+02 5.75074752e+00 1.53106959e+02 2.55172341e+00 8.10124316e+00 7.82630337e+01
1716.lowfreq: -4.3960 -0.0020 -0.0019 -0.0015 4.2407 6.6404 23.3238 52.9372 65.4233
frequency: 23.1327 52.8676 65.3905 81.3564 100.6291 138.6340 178.0604 190.7462 198.5174 247.4213 274.4415 322.5321 389.7656 442.8425 470.2669 484.8405 503.1202 565.0091 576.1210 629.6762 667.9992 680.5827 692.5658 705.2173 800.5538 819.4193 823.8847 859.8108 872.9067 895.9718 898.8644 907.0882 947.9950 988.5923 1034.4721 1059.9415 1077.9093 1081.4026 1090.1258 1106.5386 1123.7331 1163.3334 1183.6301 1201.4053 1217.0294 1241.2115 1267.9981 1286.4297 1299.7539 1315.9566 1335.1411 1348.0059 1356.2558 1397.6362 1444.6789 1457.9856 1459.1764 1462.5391 1480.5297 1488.5288 1496.9202 1533.6699 1546.9351 1634.1313 2928.7931 2933.4311 2939.6873 2980.6414 3004.1949 3030.1071 3037.5649 3065.3068 3081.9043 3113.8503 3138.1077 3165.4862 3184.4295 3238.4323
redmass: 4.8850 3.4063 4.5104 2.2767 2.3551 1.5011 3.7507 3.1223 5.2240 2.8298 2.7903 2.5479 2.6917 4.7048 4.0389 4.5360 3.5217 3.0477 7.0093 3.5045 4.4754 5.2107 1.2237 6.7281 3.6479 1.3495 4.3164 1.9422 1.5347 2.5889 1.9723 1.3667 2.7490 1.1486 1.9664 2.7537 1.2879 1.6031 1.7257 1.3371 1.7731 1.5880 1.5542 1.5659 2.9768 1.4016 1.3952 1.7620 1.4558 1.2410 1.5128 2.3701 1.5831 2.0341 1.3059 2.7532 1.2313 1.2217 1.0586 1.0568 1.1994 5.3878 4.6058 5.7997 1.0675 1.0549 1.0536 1.0954 1.0655 1.0894 1.0913 1.1042 1.0992 1.0903 1.0887 1.0896 1.0974 1.0996
irintensity: 0.3478 2.3741 0.8746 2.5423 0.7086 0.8436 3.4359 1.7260 0.1788 0.1574 0.2800 7.3781 0.5908 4.2864 4.0354 9.1621 1.9604 1.8024 3.6913 13.9346 11.4193 3.1934 94.9971 14.3652 26.3792 18.2734 5.9187 15.8041 3.5640 2.7561 1.4708 0.0049 4.9286 40.2612 8.3515 27.4742 10.0443 39.2800 7.6960 7.9363 2.6069 18.6719 17.1869 29.7096 24.1307 21.4634 7.7641 3.7363 51.3312 27.6804 53.7715 22.6778 75.1498 61.3588 7.7750 2.7839 11.6448 4.9169 12.6207 19.7874 26.3836 6.1333 140.9510 56.3281 32.0379 113.8977 120.6942 29.3111 59.0353 39.7524 74.9941 55.9719 25.3739 0.7445 18.4119 8.2259 8.1287 0.6305
temp: 298.150 k
press: 1.00000 atm
elementType: 16 7 7 6 6 6 6 6 6 6 6 6 6 6 1 1 1 1 1 1 1 1 1 1 1 1 1 1
symmnumber: 1
zpe: 595332.2 jmol-1
zpe.correction: 0.226750 hartree
zpe.thermalcorrener: 0.240605 hartree
zpe.thermalcorrenthalpy: 0.241549 hartree
zpe.thermalcorrgfe: 0.184337 hartree
zpe.sumelectzpe: -934.046108 hartree
zpe.sumelectthermal: -934.032254 hartree
zpe.sumelectthermalent: -934.031309 hartree
zpe.sumelectthermalfe: -934.088521 hartree
dipole: -2.0103 3.4470 -0.0489
dipole: 3.9907
quadrupole: -69.7939 -86.1604 -95.0940
quadrupole: -0.9957 1.2548 1.1097
quadrupole: 13.8888 -2.4776 -11.4112 -0.9957 1.2548 1.1097
hfenergy: -934.2728584 hartree
pointgroup: C01 [X(C11H14N2S1)]
dipole: -0.731856 1.3890458 -0.0011193 debye
polarizability: 282.2171061|0.0655371|152.5534173|4.5270826|9.2672668|78.6201434 unknown
InChI: InChI=1S/C11H14N2S/c1-13-8-3-7-12-11(13)6-5-10-4-2-9-14-10/h2,4-6,9H,3,7-8H2,1H3
charge 0 multiplicity 1
28 atoms
S  3.608257 -1.490045 -0.263403
N  -2.468864 0.93658 -0.187446
N  -1.743421 -1.375822 -0.088089
C  -3.904896 0.612292 -0.013562
C  -4.09595 -0.807626 0.550333
C  -3.161356 -1.780528 -0.205966
C  -1.488771 -0.072281 -0.09783
C  -2.162432 2.352263 -0.433287
C  -0.076601 0.370603 0.01132
C  0.966709 -0.509366 -0.119258
C  2.372472 -0.180217 0.014014
C  3.020587 1.019298 0.331556
C  4.45313 0.929832 0.358706
C  4.936975 -0.339375 0.064296
H  -4.428132 0.710517 -0.98956
H  -4.357583 1.357789 0.672537
H  -5.157112 -1.103319 0.457419
H  -3.83061 -0.823708 1.624089
H  -3.260643 -2.808012 0.187229
H  -3.458677 -1.814754 -1.278485
H  -3.028124 2.822767 -0.935032
H  -1.296077 2.463084 -1.106538
H  -1.964256 2.922616 0.499432
H  0.11754 1.426235 0.231854
H  0.687969 -1.550609 -0.330465
H  2.476925 1.942838 0.546602
H  5.106556 1.774418 0.590882
H  5.967284 -0.686773 0.016654
