program: Gaussian 09
title: 000048963
version: EM64L-G09RevD.01
frameworkgroup: C1[X(C16H23NO2)]
method: RPBEPBE
basis: SDD
operation: Freq
keyword: #p
keyword: freq=noraman
keyword: PBEPBE/SDD
title: #p freq=noraman PBEPBE/SDD
converged: NO YES NO NO
title: Mulliken charges:
elementType: O O N C C C C C C C C C C C C C C C C H H H H H H H H H H H H H H H H H H H H H H H
charge: -0.291240 -0.256805 -0.082915 -0.020972 -0.389230 -0.424652 -0.411433 -0.362817 -0.351781 -0.741772 -0.454959 -0.237486 0.195570 0.213654 -0.342002 -0.339646 -0.221376 -0.218576 -0.224006 0.217567 0.209406 0.162530 0.212478 0.185173 0.192274 0.209709 0.173269 0.213439 0.206517 0.193333 0.212836 0.217611 0.206705 0.220428 0.221432 0.219395 0.255885 0.270134 0.268917 0.232347 0.229797 0.231264
chargesum: 0.00000
title: Mulliken charges with hydrogens summed into heavy atoms:
elementType: O O N C C C C C C C C C C C C C C C C
charge: -0.291240 -0.256805 -0.082915 0.196594 -0.017294 -0.027000 -0.009450 0.023890 0.048068 -0.104619 -0.013099 0.237794 0.195570 0.213654 -0.071868 -0.070729 0.010971 0.011221 0.007258
polarizability: 2.53086302e+02 6.01472621e+00 1.74195714e+02 1.38212956e+01 4.24526167e+00 1.29331305e+02
1716.lowfreq: -18.7233 -7.7345 -0.0010 -0.0002 0.0005 2.1063 6.7914 18.6571 25.6584
frequency: -6.0355 18.0532 25.4002 43.0380 68.9043 74.5349 118.3310 121.0971 152.2767 195.0293 198.9504 208.2297 225.7067 235.0924 274.9241 305.1079 330.8846 343.2578 374.6900 403.8363 411.1957 420.0689 432.7866 442.4238 470.8231 529.6680 576.8417 614.0433 658.9025 680.2744 702.1458 743.8078 786.9097 795.1845 798.8971 816.6746 852.4088 864.7720 873.2161 889.3448 901.8304 934.8967 936.8069 953.9911 969.9122 990.3934 991.2055 995.2553 995.7488 1007.5812 1021.2497 1051.1738 1062.2057 1082.3583 1087.8184 1096.9923 1105.2621 1126.1330 1131.0165 1155.4878 1160.9001 1162.1438 1173.1386 1181.0320 1209.1504 1226.1551 1242.4521 1255.8253 1267.5764 1269.5885 1280.6450 1296.3924 1312.0195 1314.2856 1321.0640 1339.1524 1344.4292 1352.4044 1363.6074 1374.0658 1383.0073 1389.1365 1394.0892 1437.4972 1454.7155 1456.0550 1463.3379 1468.1153 1469.8572 1475.3285 1477.0736 1477.3679 1480.0983 1482.8975 1583.8438 1611.0495 1618.9381 2806.4126 2818.4393 2844.1221 2955.1074 2967.0851 2979.9394 2986.1524 2999.5182 3005.9932 3013.5326 3014.6083 3026.6113 3035.0182 3049.7259 3054.3858 3061.1933 3067.8152 3096.6804 3128.7014 3141.0890 3154.2473 3166.0722 3177.4044
redmass: 4.4984 4.3474 3.6996 4.1160 5.0293 5.3360 3.0753 3.1197 2.4371 2.7837 1.0573 3.6364 3.2967 2.8968 1.9275 3.2541 4.3669 2.2139 3.1346 2.8264 2.9477 3.8194 2.1736 3.6656 4.1248 2.4584 2.6448 6.4402 6.8245 4.9740 1.5888 2.0929 1.5768 2.3207 4.6289 2.3960 1.4711 1.2451 1.9232 1.4613 2.1602 3.3865 2.0942 1.4237 1.6239 5.7956 1.6903 1.5960 1.4601 1.3285 2.6312 2.1331 2.7411 2.2794 1.9361 1.9002 2.5346 2.4561 1.9506 1.4132 2.0210 1.4306 1.0566 1.1245 1.8475 1.3521 3.2309 1.2975 1.1780 1.2837 1.3664 1.3532 1.2647 1.3196 1.3599 1.4012 1.4625 1.5302 1.4299 1.5285 1.2692 10.0361 1.3891 2.2431 1.0843 1.0869 1.0891 1.0899 1.0756 1.0554 1.0590 2.2190 1.0925 1.1035 6.9603 6.2331 9.9296 1.0707 1.0709 1.0700 1.0632 1.0366 1.0812 1.0618 1.0673 1.0816 1.0735 1.0752 1.0964 1.0883 1.1033 1.0989 1.0990 1.0990 1.1052 1.0854 1.0891 1.0939 1.0977 1.0978
irintensity: 0.4550 0.0930 0.1677 0.4976 0.6947 0.6710 0.5875 1.6470 0.4284 0.8868 0.1383 1.8092 3.9876 0.8492 5.5764 7.9121 12.0424 1.1767 3.2924 0.0040 1.2423 0.5807 0.3847 0.4440 3.9481 0.0759 4.4923 0.5089 5.4474 14.5071 92.5159 9.3979 0.0008 21.8597 6.5225 1.9849 7.0871 0.0338 2.3196 6.8881 2.4378 28.1006 1.0820 4.1334 14.9956 1.0457 2.9223 4.8164 1.9061 0.5038 77.8809 7.1467 254.1057 30.1047 52.4435 1.7749 16.0946 17.2400 9.8296 9.5387 23.7253 5.1283 0.0792 43.9645 6.1583 1.7887 351.6542 27.1309 2.8236 8.1382 4.8880 8.5757 14.3470 1.7317 5.9426 2.1681 1.2128 2.2028 7.4328 1.3257 18.6824 2.5724 0.7607 15.1248 11.8128 5.9259 1.9838 1.7742 8.6002 6.7589 11.6321 9.1643 13.4113 12.3689 43.5355 11.3474 141.5431 52.9882 86.2577 191.8990 28.3223 47.6985 32.5799 25.0577 11.1265 12.3783 24.2809 54.9678 48.2953 42.1565 47.6215 26.8243 75.3163 43.0584 34.3777 0.1601 12.2812 17.0350 22.4582 9.5762
temp: 298.150 k
press: 1.00000 atm
elementType: 8 8 7 6 6 6 6 6 6 6 6 6 6 6 6 6 6 6 6 1 1 1 1 1 1 1 1 1 1 1 1 1 1 1 1 1 1 1 1 1 1 1
symmnumber: 1
zpe: 943813.8 jmol-1
zpe.correction: 0.359480 hartree
zpe.thermalcorrener: 0.377499 hartree
zpe.thermalcorrenthalpy: 0.378443 hartree
zpe.thermalcorrgfe: 0.311538 hartree
zpe.sumelectzpe: -827.245409 hartree
zpe.sumelectthermal: -827.227390 hartree
zpe.sumelectthermalent: -827.226446 hartree
zpe.sumelectthermalfe: -827.293351 hartree
dipole: -0.5535 2.4871 0.4596
dipole: 2.5891
quadrupole: -94.2506 -114.1719 -115.3277
quadrupole: 1.3829 2.5024 -1.3521
quadrupole: 13.6661 -6.2552 -7.4109 1.3829 2.5024 -1.3521
hfenergy: -827.6048889 hartree
pointgroup: C01 [X(C16H23N1O2)]
dipole: -0.2246371 -0.6716115 0.7321554 debye
polarizability: 253.3573075|-13.6894692|145.3974193|-0.4219328|-22.2377449|157.8585938 unknown
InChI: InChI=1S/C16H23NO2/c1-14-7-5-10-17(13-14)11-6-12-19-16(18)15-8-3-2-4-9-15/h2-4,8-9,14H,5-7,10-13H2,1H3
charge 0 multiplicity 1
42 atoms
O  1.350485 -0.003453 0.624813
O  1.711088 1.43244 -1.175878
N  -3.047183 -0.192872 0.536864
C  -5.094489 0.614033 -0.676534
C  -4.350403 0.507495 0.673444
C  -5.284729 -0.800824 -1.27396
C  -3.933946 -1.543555 -1.364637
C  -3.227223 -1.568297 0.005911
C  -2.274013 -0.157026 1.803935
C  -6.438174 1.352877 -0.508888
C  -0.785446 -0.53134 1.633615
C  -0.103745 0.335498 0.57477
C  2.161864 0.631864 -0.317687
C  3.598409 0.249865 -0.172639
C  4.529821 0.803725 -1.088964
C  4.046589 -0.631125 0.845843
C  5.898123 0.479078 -0.988311
C  5.417224 -0.951981 0.94369
C  6.344592 -0.398844 0.02854
H  -4.44435 1.19322 -1.364043
H  -4.156525 1.521694 1.072506
H  -5.019441 -0.017666 1.409581
H  -5.757054 -0.732391 -2.273109
H  -5.981841 -1.374313 -0.626033
H  -4.082139 -2.582316 -1.717894
H  -3.276955 -1.031806 -2.094181
H  -3.82699 -2.195024 0.720317
H  -2.235824 -2.045634 -0.094359
H  -2.335151 0.87743 2.196033
H  -2.725512 -0.82357 2.584632
H  -6.292979 2.373943 -0.108555
H  -6.962809 1.442293 -1.478281
H  -7.106623 0.807673 0.185563
H  -0.277254 -0.387991 2.606276
H  -0.666468 -1.598468 1.369759
H  -0.219507 1.415538 0.783054
H  -0.48863 0.143568 -0.440211
H  4.159593 1.481926 -1.864995
H  3.318891 -1.049868 1.546459
H  6.615134 0.907359 -1.697067
H  5.763655 -1.630397 1.731039
H  7.40843 -0.64986 0.107681
