program: Gaussian 09
title: 000049035
version: EM64L-G09RevD.01
frameworkgroup: C1[X(C20H31NO3)]
method: RPBEPBE
basis: SDD
operation: Freq
keyword: #p
keyword: freq=noraman
keyword: PBEPBE/SDD
title: #p freq=noraman PBEPBE/SDD
converged: YES YES NO NO
title: Mulliken charges:
elementType: O O O N C C C C C C C C C C C C C C C C C C C C H H H H H H H H H H H H H H H H H H H H H H H H H H H H H H H
charge: -0.301113 -0.237298 -0.234594 -0.126446 0.017825 -0.405057 -0.364304 -0.416421 -0.387145 -0.326318 -0.748989 -0.411861 -0.268795 0.186460 0.107726 0.245466 -0.377951 -0.296988 -0.341754 -0.314681 -0.354041 -0.687300 -0.251638 -0.226624 0.166718 0.183469 0.207663 0.200436 0.170807 0.187752 0.212481 0.204486 0.188482 0.183250 0.223562 0.204671 0.203308 0.262129 0.195136 0.211575 0.209693 0.260733 0.210431 0.221897 0.206909 0.201813 0.192986 0.190999 0.267809 0.250974 0.212360 0.216220 0.215173 0.231120 0.226801
chargesum: 0.00000
title: Mulliken charges with hydrogens summed into heavy atoms:
elementType: O O O N C C C C C C C C C C C C C C C C C C C C
charge: -0.301113 -0.237298 -0.234594 -0.126446 0.184543 -0.013924 0.006939 -0.016187 0.005823 0.080494 -0.078881 -0.005150 0.201631 0.186460 0.107726 0.245466 0.054377 0.111734 0.042231 -0.046872 -0.103068 -0.043546 -0.020519 0.000177
polarizability: 2.67538844e+02 1.46124830e+00 2.69811122e+02 2.77129738e+01 1.06089564e+01 1.69486179e+02
1716.lowfreq: -8.2855 -4.1646 -0.0006 0.0003 0.0007 4.5099 5.5175 14.3527 29.4149
frequency: -2.2282 13.7750 29.2033 37.7915 43.1662 51.0174 52.1221 62.2613 67.8779 104.0692 105.5195 124.2324 149.0404 153.5860 176.7768 186.8600 199.6144 213.4687 228.7577 232.4761 259.1241 287.3626 308.7583 313.5917 331.1405 337.3649 348.2773 394.4271 405.8569 413.2673 415.1817 443.2069 456.8681 473.9820 509.9150 517.6900 545.2830 552.6649 590.2244 648.9547 678.3871 694.0379 741.8002 759.3533 764.8175 769.4384 785.0934 803.0928 816.2201 822.8432 827.1919 858.5042 867.7437 869.6138 892.0694 901.6821 904.4640 933.1315 938.2036 954.5783 961.5857 976.9528 983.1487 995.8224 1007.0884 1014.1480 1038.6962 1039.5516 1047.3447 1067.1144 1079.0073 1084.0563 1093.3452 1112.0444 1122.3841 1123.3456 1129.1154 1130.2380 1143.1415 1154.7802 1175.4701 1177.2597 1202.6179 1212.8001 1215.4427 1218.8403 1230.0282 1254.0549 1262.2557 1265.9899 1274.7893 1277.2710 1282.6073 1284.0659 1285.7827 1303.5473 1320.5733 1337.5016 1340.6847 1345.5132 1347.2557 1348.5967 1353.3387 1364.1359 1371.6817 1378.8816 1387.4291 1388.2452 1394.0602 1429.3579 1446.5649 1451.5975 1460.4878 1466.1899 1467.9881 1469.9533 1470.3421 1474.5332 1476.7432 1477.7457 1477.8626 1478.9002 1485.6685 1492.1300 1496.0564 1583.3110 1599.2793 1632.1197 2802.8987 2818.9314 2869.0577 2945.2043 2964.8111 2965.0606 2977.0232 2977.5115 2983.0582 2983.3118 2989.9579 2997.8918 3005.4892 3009.6706 3011.1785 3023.6571 3030.3630 3039.8642 3043.9940 3050.4510 3063.4979 3070.0192 3075.7383 3077.1292 3083.0780 3088.6294 3089.5635 3132.3981 3154.5957 3170.3329 3180.1475
redmass: 4.1717 4.3260 4.0417 4.2932 4.1508 2.3264 2.7931 3.7037 3.3846 2.9171 3.6589 4.0288 2.9970 2.2067 3.3852 2.3880 1.3599 3.0017 3.2870 1.1660 4.4105 2.3016 4.2750 4.9495 1.8249 2.1174 2.3835 3.4309 3.1845 3.0735 3.0597 2.8876 3.4331 2.6680 3.1994 3.2524 1.8574 3.3766 6.5185 6.5862 4.5118 2.7774 1.0790 1.8636 2.2622 6.1278 2.5758 2.8952 1.1524 1.5196 2.3693 1.5072 2.4145 2.5725 1.6468 2.1013 1.8112 2.0193 1.1563 1.3682 7.3135 1.8862 1.3341 1.2726 1.8766 5.0607 2.1835 3.2722 2.2302 2.1984 1.9008 2.1868 2.2919 2.1288 2.1184 2.0151 1.8671 2.2130 1.4359 2.2993 1.0756 1.3979 1.2641 1.3783 2.1418 2.1695 3.1944 1.5336 1.2747 1.1989 1.3051 1.4819 1.1897 1.2289 1.0614 1.2859 1.2665 1.3655 1.3733 1.4767 1.4691 1.5611 1.6811 1.3834 2.1550 1.3973 1.3268 2.1395 1.3041 2.2676 1.0909 1.0896 1.0875 1.1761 1.0899 1.1694 1.0843 1.1135 1.2116 1.0479 1.0904 1.0648 1.2777 1.1893 1.0592 7.1826 6.5755 10.3790 1.0798 1.0718 1.0724 1.0549 1.0616 1.0589 1.0364 1.0584 1.0604 1.0394 1.0598 1.0638 1.1017 1.1012 1.0604 1.0888 1.0941 1.1029 1.0990 1.1035 1.1037 1.0976 1.1006 1.1006 1.0901 1.1042 1.0993 1.0865 1.0910 1.0936 1.0980
irintensity: 0.0472 0.5306 1.1016 0.4227 0.6874 0.0863 1.1313 1.2094 0.3584 0.6392 1.1211 2.0889 0.8087 0.8839 0.3889 2.1545 2.9519 0.2544 4.1253 0.3630 3.2811 3.3041 4.8989 1.7607 2.0220 1.4077 5.2592 6.0795 2.4697 0.6224 0.8516 0.6263 0.5848 0.9188 1.3491 4.3342 1.3291 1.2062 7.0522 11.7730 26.0239 8.2675 15.2200 73.6729 13.8935 1.4244 4.0626 7.0112 1.0727 3.8369 0.1922 0.9305 1.6404 2.0915 8.0771 14.1762 21.5202 4.5591 0.9615 4.5820 78.6229 5.5843 1.0724 4.9278 26.6842 320.4681 17.9520 23.8445 13.6869 43.2732 12.8129 4.2932 36.0322 27.1200 11.4351 13.0192 36.2031 7.9702 1.7267 8.3024 10.2111 1.8133 44.4048 0.5924 118.0972 53.1154 265.3425 6.3039 2.4434 7.6536 5.5233 29.1538 0.5785 7.7893 0.0364 7.2062 13.9426 0.1899 2.4676 0.3760 0.3157 0.9512 16.5827 6.7729 8.5586 4.0199 24.3384 20.4630 4.1409 27.4347 10.6986 6.5411 9.5924 28.9070 9.7494 20.0665 0.9417 14.5754 36.3980 15.8486 3.5752 25.0007 9.8302 18.7813 18.8224 40.7765 15.0917 235.0376 52.5551 141.1770 135.8553 36.0417 48.8487 36.8713 28.4496 25.4011 50.0960 25.6923 26.2109 28.2140 32.0296 5.7315 49.5454 75.0451 42.8307 26.0909 27.4791 85.9534 9.7898 40.6496 80.2901 72.9929 23.2682 14.6475 30.2040 5.2800 18.6580 16.1022 10.6615
temp: 298.150 k
press: 1.00000 atm
elementType: 8 8 8 7 6 6 6 6 6 6 6 6 6 6 6 6 6 6 6 6 6 6 6 6 1 1 1 1 1 1 1 1 1 1 1 1 1 1 1 1 1 1 1 1 1 1 1 1 1 1 1 1 1 1 1
symmnumber: 1
zpe: 1245803.0 jmol-1
zpe.correction: 0.474501 hartree
zpe.thermalcorrener: 0.499264 hartree
zpe.thermalcorrenthalpy: 0.500208 hartree
zpe.thermalcorrgfe: 0.417653 hartree
zpe.sumelectzpe: -1059.262401 hartree
zpe.sumelectthermal: -1059.237638 hartree
zpe.sumelectthermalent: -1059.236694 hartree
zpe.sumelectthermalfe: -1059.319250 hartree
dipole: -1.0507 0.2761 -2.2590
dipole: 2.5067
quadrupole: -123.6492 -134.4587 -150.2741
quadrupole: -5.3623 5.5553 -0.8459
quadrupole: 12.4781 1.6686 -14.1467 -5.3623 5.5553 -0.8459
hfenergy: -1059.7369026 hartree
pointgroup: C01[X(C20H31N1O3)]
dipole: -0.3139109 -0.3061812 0.8833624 debye
polarizability: 269.4727852|-1.3053834|268.1584484|-29.1153751|-2.4871829|169.2049123 unknown
InChI: InChI=1S/C20H31NO3/c1-3-4-15-23-19-12-6-5-11-18(19)20(22)24-16-9-14-21-13-8-7-10-17(21)2/h5-6,11-12,17H,3-4,7-10,13-16H2,1-2H3
charge 0 multiplicity 1
55 atoms
O  -0.541214 2.301607 -0.563698
O  -1.85795 -1.607783 -0.203718
O  -0.438194 0.276239 -1.727234
N  3.089175 1.656123 0.420618
C  3.192085 0.355256 1.160956
C  4.19903 -0.571397 0.428824
C  4.416149 2.315081 0.281913
C  5.583995 0.079973 0.237373
C  5.424354 1.436237 -0.479651
C  2.082745 2.61534 0.947965
C  1.833545 -0.37019 1.274825
C  1.52001 3.535895 -0.162203
C  0.728954 2.75109 -1.210676
C  -1.028614 1.026553 -0.916946
C  -2.317921 0.756371 -0.210533
C  -2.74596 -0.577315 0.0890
C  -1.086087 -3.888889 -0.321057
C  -2.256695 -2.99802 0.098399
C  -1.376022 -5.38673 -0.068847
C  -3.163747 1.839293 0.141636
C  -4.011201 -0.789877 0.697445
C  -0.196179 -6.289514 -0.488938
C  -4.419704 1.627097 0.745305
C  -4.8404 0.305759 1.01585
H  3.590386 0.537658 2.197095
H  4.29224 -1.512677 1.004883
H  3.76859 -0.826582 -0.560196
H  4.277392 3.272446 -0.253174
H  4.841118 2.565235 1.291821
H  6.059189 0.241755 1.227566
H  6.251338 -0.592336 -0.335149
H  5.052977 1.272695 -1.509822
H  6.395521 1.963951 -0.549607
H  2.508324 3.244912 1.768868
H  1.23467 2.059457 1.377796
H  1.129926 0.123518 1.967798
H  2.00022 -1.393502 1.659689
H  1.350852 -0.448935 0.284179
H  2.342237 4.06864 -0.679015
H  0.87148 4.309004 0.29393
H  0.446809 3.377378 -2.076741
H  1.294306 1.867125 -1.552214
H  -0.182129 -3.578098 0.23712
H  -0.873856 -3.716617 -1.392907
H  -3.175688 -3.251727 -0.470342
H  -2.468296 -3.098928 1.18394
H  -2.286649 -5.687538 -0.626491
H  -1.598911 -5.547533 1.006072
H  -2.814949 2.85217 -0.076769
H  -4.3498 -1.803322 0.928319
H  0.719719 -6.031479 0.074843
H  -0.418994 -7.356225 -0.304449
H  0.028544 -6.170645 -1.565195
H  -5.060571 2.477532 0.997949
H  -5.815554 0.122267 1.481096
