program: Gaussian 09
title: 000048930
version: EM64L-G09RevD.01
frameworkgroup: C1[X(C15H21NO2)]
method: RPBEPBE
basis: SDD
operation: Freq
keyword: #p
keyword: freq=noraman
keyword: PBEPBE/SDD
title: #p freq=noraman PBEPBE/SDD
converged: YES YES NO NO
title: Mulliken charges:
elementType: O O N C C C C C C C C C C C C C C C H H H H H H H H H H H H H H H H H H H H H
charge: -0.284834 -0.257620 -0.070188 -0.355474 -0.367707 -0.398257 -0.391193 -0.398043 -0.329045 -0.412554 -0.262561 0.194933 0.215350 -0.340878 -0.338174 -0.221572 -0.218276 -0.223057 0.207645 0.167582 0.166837 0.211626 0.205891 0.192074 0.192033 0.205035 0.188898 0.214107 0.173068 0.202795 0.229538 0.215662 0.223924 0.226037 0.269929 0.270579 0.233020 0.230905 0.231963
chargesum: 0.00000
title: Mulliken charges with hydrogens summed into heavy atoms:
elementType: O O N C C C C C C C C C C C C C C C
charge: -0.284834 -0.257620 -0.070188 0.019754 0.010755 -0.000291 0.005874 0.004963 0.046818 0.032646 0.187400 0.194933 0.215350 -0.070949 -0.067595 0.011447 0.012629 0.008906
polarizability: 2.41415128e+02 9.13341811e+00 1.72128067e+02 3.88827854e+00 -7.54976894e+00 1.11158044e+02
1716.lowfreq: 0.0001 0.0006 0.0007 1.1499 5.1827 6.2002 21.7379 29.8762 35.4036
frequency: 21.5762 25.8834 35.1779 48.9339 68.4313 77.3597 102.4244 133.4407 160.9726 174.2938 204.6493 233.8113 251.4003 302.4645 317.1186 363.3946 384.3703 403.8297 422.8559 442.6278 448.5342 470.4868 501.0797 569.0344 614.3115 662.2119 680.5639 702.2039 754.5778 762.9249 795.4948 802.3761 804.3263 848.2843 856.5208 864.7184 865.6459 911.1989 918.1838 954.7131 958.7176 990.3791 994.1143 996.2353 1008.1534 1021.2858 1042.8645 1053.7362 1060.2986 1070.2257 1085.2761 1091.9165 1106.4077 1123.2458 1128.1837 1153.9799 1157.7404 1173.5313 1179.8701 1181.7605 1231.5174 1242.6191 1258.8625 1263.7355 1268.3947 1281.4791 1287.4517 1302.9464 1314.8870 1331.2412 1342.3427 1345.5620 1351.6360 1366.5738 1375.4820 1389.7651 1397.1381 1438.1412 1451.7478 1460.9732 1462.0605 1466.3726 1470.9662 1473.5686 1477.8614 1481.1041 1488.8435 1584.2751 1611.3619 1619.6691 2812.0449 2817.7038 2835.7927 2967.8343 2985.8813 2986.6524 2995.4433 3001.2778 3011.4381 3022.1904 3033.5917 3042.3494 3046.3524 3051.3722 3055.5928 3083.3698 3129.3925 3142.1740 3154.6061 3166.7367 3178.4120
redmass: 4.3026 3.2068 4.5578 2.9366 2.4880 4.5820 3.9478 3.4604 4.5607 3.1990 4.0295 2.1033 2.9752 2.2999 3.6441 5.3024 1.8457 2.8290 3.7573 3.6663 3.0013 2.9662 4.3350 2.0011 6.4393 6.7107 5.0046 1.5894 3.4019 1.1201 2.1897 4.0998 1.8013 1.6017 2.0368 1.3308 1.2815 2.1923 7.3411 1.4212 1.3021 6.1459 2.5985 1.3846 1.3283 2.7129 2.4524 2.1806 2.5167 2.1281 1.9606 2.6747 1.7943 2.5239 1.7337 1.2884 2.4768 1.0572 1.2009 1.1243 1.6913 3.2667 1.2495 1.1827 1.2020 1.3524 1.1841 1.4064 1.3187 1.2835 1.3926 1.4492 1.4614 1.4343 1.4589 10.0864 1.4427 2.2493 1.0910 1.0873 1.0814 1.0909 1.0803 1.0977 2.1221 1.1251 1.0966 6.9191 6.2197 9.9631 1.0718 1.0706 1.0697 1.0622 1.0615 1.0614 1.0576 1.0840 1.0622 1.0869 1.0955 1.0882 1.1026 1.1047 1.1034 1.1058 1.0854 1.0891 1.0939 1.0979 1.0977
irintensity: 0.0559 0.8254 0.4389 0.1774 1.0567 0.7027 1.1579 1.2739 1.9784 0.1371 2.7322 0.1985 2.1570 3.7651 8.9523 0.9411 3.9581 0.0011 9.9857 0.4260 0.5008 10.8596 3.5857 0.5941 0.5342 4.9941 14.0319 93.9599 10.3628 1.4668 23.0589 7.4350 3.4046 1.1125 5.5540 1.4077 0.4663 3.9528 24.7341 4.1681 3.2627 0.3898 18.8651 0.0259 0.4313 80.5632 12.4911 15.4850 266.5409 2.9882 13.6266 39.5676 13.7175 8.6157 9.1877 5.9664 22.1903 0.2920 2.3797 44.5630 7.8659 366.5469 3.7646 11.1763 6.7507 13.0823 4.8161 18.9716 1.8477 5.3511 1.4667 14.6146 1.7190 1.1777 7.8859 2.6816 3.9204 16.1053 7.3071 13.2800 3.0382 9.9023 0.7126 2.7481 7.8150 2.5714 13.7724 44.8008 12.2575 158.7457 47.9958 43.0548 225.2410 38.4794 34.7639 34.1710 14.0428 9.3934 22.0210 74.9211 70.4404 38.3695 10.1640 1.5567 101.6091 56.9002 0.2858 11.4853 16.1611 22.5581 8.5548
temp: 298.150 k
press: 1.00000 atm
elementType: 8 8 7 6 6 6 6 6 6 6 6 6 6 6 6 6 6 6 1 1 1 1 1 1 1 1 1 1 1 1 1 1 1 1 1 1 1 1 1
symmnumber: 1
zpe: 872670.5 jmol-1
zpe.correction: 0.332383 hartree
zpe.thermalcorrener: 0.349856 hartree
zpe.thermalcorrenthalpy: 0.350801 hartree
zpe.thermalcorrgfe: 0.284021 hartree
zpe.sumelectzpe: -788.018261 hartree
zpe.sumelectthermal: -788.000788 hartree
zpe.sumelectthermalent: -787.999844 hartree
zpe.sumelectthermalfe: -788.066624 hartree
dipole: -0.9959 1.6625 0.1084
dipole: 1.9410
quadrupole: -90.4916 -108.8072 -110.7152
quadrupole: 10.5285 -2.5869 1.0113
quadrupole: 12.8464 -5.4692 -7.3772 10.5285 -2.5869 1.0113
hfenergy: -788.3506441 hartree
pointgroup: C01 [X(C15H21N1O2)]
dipole: 0.3854658 -0.6589822 0.0185818 debye
polarizability: 241.6460167|8.5126948|171.1823082|-1.8329622|10.3232745|111.8729149 unknown
InChI: InChI=1S/C15H21NO2/c17-15(14-8-3-1-4-9-14)18-13-7-12-16-10-5-2-6-11-16/h1,3-4,8-9H,2,5-7,10-13H2
charge 0 multiplicity 1
39 atoms
O  -1.207134 0.387935 -0.076277
O  -2.463803 2.273754 0.468898
N  3.732408 0.129557 -0.189565
C  3.962381 -0.820593 0.929688
C  4.960386 0.918122 -0.477419
C  5.110398 -1.799109 0.605811
C  6.138711 -0.003413 -0.851355
C  6.408774 -1.030434 0.271481
C  2.55698 1.006251 0.037012
C  1.2140 0.256978 -0.112076
C  0.03007 1.207035 0.071371
C  -2.413317 1.058265 0.151691
C  -3.59547 0.165316 -0.027208
C  -4.885084 0.717497 0.187821
C  -3.461867 -1.196769 -0.403421
C  -6.032471 -0.085895 0.027881
C  -4.613276 -1.996564 -0.562786
C  -5.898625 -1.444232 -0.347988
H  3.033637 -1.388525 1.115255
H  4.207973 -0.265474 1.875952
H  5.254726 1.546362 0.406565
H  4.739857 1.608985 -1.312964
H  4.813622 -2.419763 -0.26167
H  5.267435 -2.477317 1.466698
H  7.038763 0.611777 -1.044432
H  5.888201 -0.536736 -1.788729
H  6.765813 -0.499072 1.17833
H  7.210082 -1.732036 -0.028291
H  2.599815 1.503377 1.043101
H  2.595891 1.816359 -0.717966
H  1.175484 -0.208855 -1.112988
H  1.130685 -0.5553 0.632909
H  0.009572 2.008899 -0.690578
H  0.01998 1.683483 1.069642
H  -4.961619 1.770884 0.477171
H  -2.462733 -1.609896 -0.567156
H  -7.026963 0.341848 0.194519
H  -4.511121 -3.047519 -0.854431
H  -6.790663 -2.068384 -0.473198
