program: Gaussian 09
title: 000049025
version: EM64L-G09RevD.01
frameworkgroup: C1[X(C21H33NO3)]
method: RPBEPBE
basis: SDD
operation: Freq
keyword: #p
keyword: freq=noraman
keyword: PBEPBE/SDD
title: #p freq=noraman PBEPBE/SDD
converged: YES YES NO NO
title: Mulliken charges:
elementType: O O O N C C C C C C C C C C C C C C C C C C C C C H H H H H H H H H H H H H H H H H H H H H H H H H H H H H H H H H
charge: -0.303108 -0.263956 -0.257234 -0.162944 -0.028098 0.017952 -0.401324 -0.397275 -0.435131 -0.341498 -0.743465 -0.762730 -0.427907 -0.254609 0.194790 0.212587 -0.343366 -0.329971 -0.381123 -0.296200 0.357068 -0.343133 -0.337452 -0.374683 -0.685421 0.195435 0.179826 0.207198 0.187024 0.185618 0.201759 0.212479 0.196198 0.184933 0.231578 0.222176 0.217863 0.216454 0.237437 0.216453 0.208061 0.195491 0.212794 0.248832 0.224908 0.261464 0.271296 0.212226 0.212334 0.206143 0.206126 0.194089 0.194055 0.248408 0.254850 0.213015 0.218583 0.213125
chargesum: 0.00000
title: Mulliken charges with hydrogens summed into heavy atoms:
elementType: O O O N C C C C C C C C C C C C C C C C C C C C C
charge: -0.303108 -0.263956 -0.257234 -0.162944 0.167337 0.197778 -0.007103 -0.009897 -0.026453 0.075013 -0.086972 -0.100779 -0.019622 0.219131 0.194790 0.212587 -0.081903 -0.058675 0.043438 0.116069 0.357068 0.045012 -0.089044 -0.119833 -0.040698
polarizability: 3.48239576e+02 2.81846188e+01 2.14642121e+02 1.32169413e+01 -1.68559824e+01 2.02065894e+02
1716.lowfreq: -11.1845 -1.3533 -0.0017 -0.0008 0.0006 5.0970 11.9645 16.8789 20.6829
frequency: 8.0458 15.7665 20.1794 33.1421 43.5910 46.5444 60.3433 71.2956 77.9185 85.8055 106.8534 132.0666 146.8358 150.7574 154.1049 181.0952 191.5355 197.2133 225.2536 232.5838 234.0949 239.3456 266.0459 279.4068 306.6979 325.7066 339.9406 359.7279 369.2059 378.9778 389.7611 406.0952 417.0536 425.1651 468.9405 484.8888 497.0067 503.3263 507.0276 528.0039 610.5997 622.3647 633.5871 669.4017 676.6972 744.4378 754.6782 766.8709 780.8685 811.0683 812.8945 816.2546 824.8112 828.8289 843.1770 855.9035 870.1634 881.5762 902.7503 904.8042 928.3413 941.8530 944.8573 962.8471 969.0267 969.7058 991.1829 991.8269 1000.0002 1014.3409 1029.8861 1041.2565 1058.2499 1062.2424 1074.6408 1084.8059 1089.5377 1095.1214 1115.1038 1118.1162 1124.5918 1139.1217 1146.0085 1153.3777 1162.3169 1170.2348 1196.5170 1208.7439 1214.3829 1215.3067 1229.2036 1247.6159 1255.5450 1270.2526 1276.0545 1281.6993 1283.7381 1287.9706 1297.5745 1298.2718 1313.8244 1326.0272 1340.7074 1345.6468 1348.1104 1349.1990 1353.1843 1358.6967 1369.2817 1371.9719 1372.9702 1381.6639 1386.2966 1388.0565 1394.3099 1427.5509 1448.0561 1454.3626 1455.5993 1464.9944 1467.8603 1469.5234 1471.3551 1473.0815 1474.5378 1478.2837 1481.3083 1481.9116 1487.9636 1490.1373 1494.8649 1497.8368 1570.6824 1613.5257 1619.7159 2839.4291 2884.0268 2950.0953 2967.4743 2971.0381 2975.2238 2977.3647 2977.7639 2981.2727 2981.8916 2990.8874 2996.3945 2996.7561 3008.0641 3012.2892 3013.9999 3027.3911 3036.8700 3043.6553 3048.1074 3061.2442 3068.8978 3073.9553 3075.9572 3077.9566 3081.7780 3082.7215 3083.9457 3092.7744 3152.3561 3155.6259 3172.2740 3177.4411
redmass: 3.6015 4.2619 4.2309 4.2304 3.5159 4.0352 2.6274 2.2159 3.8932 4.4166 3.7696 3.3889 2.5179 2.4283 3.2793 3.8981 3.6721 1.0598 2.6976 1.4061 1.2730 2.2002 3.9086 2.0528 6.3343 2.4235 2.2185 3.5972 2.4189 3.0253 2.6201 2.8117 2.9866 2.8531 3.3176 3.2852 3.4022 2.3596 2.9483 2.9420 2.0805 7.0368 7.0296 2.6441 4.1222 1.0763 4.5401 4.0873 2.5164 1.2014 2.3895 3.2936 2.8334 1.2464 1.4830 1.6162 2.5630 2.2823 2.6611 1.8405 1.7301 1.1550 1.5676 6.8242 1.5272 1.4148 1.3539 1.9049 3.0070 1.6463 1.5823 3.4485 3.4121 2.1907 1.7762 2.1987 2.1877 2.2799 1.3707 2.1006 2.4655 1.9252 1.4509 2.1999 2.4529 1.2414 1.3636 1.2389 1.5956 1.3665 3.1395 2.4557 1.8192 1.2583 1.3033 1.2045 1.1812 1.0604 1.2890 1.3503 1.3602 1.2476 1.4396 1.4225 1.4603 1.3834 1.4478 1.5851 1.3589 1.3118 2.3599 1.3125 2.0790 1.2207 1.2553 4.3337 1.0906 1.0871 1.0822 1.0726 1.0864 1.0849 1.0702 1.0810 1.0604 1.0424 1.1298 1.0567 1.0659 1.1909 1.0634 1.9205 8.2081 10.1729 6.6183 1.0805 1.0721 1.0552 1.0590 1.0582 1.0604 1.0362 1.0644 1.0401 1.0387 1.0616 1.0593 1.0753 1.1040 1.1031 1.0593 1.0970 1.1030 1.0984 1.1032 1.1043 1.0989 1.0985 1.1015 1.0995 1.0993 1.1002 1.1066 1.0866 1.0882 1.0876 1.0966 1.0967
irintensity: 0.3847 0.0754 0.2785 0.2888 0.0777 0.0798 0.0561 0.1946 0.1153 0.0172 0.1465 0.1779 0.1325 0.9362 2.0986 6.5407 2.1351 0.0290 1.2996 3.2437 2.4592 5.2825 12.4679 2.5402 0.9617 3.8759 0.0994 0.5451 4.3315 2.7681 2.8328 6.5607 0.0666 0.2196 4.1076 1.8715 1.4588 2.7772 8.1332 1.6387 5.5044 15.8925 12.9664 14.0525 25.3386 10.8667 16.5288 13.5978 1.0299 2.9252 0.5808 2.9573 0.0524 6.3858 0.2310 52.4088 10.2025 10.6771 22.2973 17.8344 6.0652 0.3969 11.0328 111.2557 11.0875 1.5650 0.3735 6.7923 32.0291 7.5160 1.4799 35.1231 241.1337 86.8908 74.8443 9.9826 6.5039 22.8354 4.6612 25.7164 10.2816 4.5509 1.8890 32.9778 20.6088 241.1979 5.9994 26.7402 16.6751 0.2402 162.3944 409.7244 123.2625 3.5926 6.5622 1.7591 0.3596 0.0487 0.0464 0.6563 4.6869 13.4949 3.3611 2.7497 0.2625 5.2330 2.7695 10.1377 5.9324 13.7846 10.9518 37.8140 15.5657 9.9274 5.6431 24.9250 6.4845 12.2836 7.2638 2.1003 23.9992 4.6135 8.1099 2.5520 12.5978 13.2690 41.6529 11.3164 2.3592 30.7109 20.6480 47.7835 65.8119 121.9716 292.5827 77.8405 101.7461 25.9725 35.3901 21.9429 25.2065 39.1408 29.5243 48.7960 30.8840 16.7678 36.7175 65.7347 28.2529 0.4584 28.8350 54.6498 22.9309 28.6700 81.7572 15.9694 40.0558 37.7238 101.9013 48.3325 23.0913 71.0028 12.3011 35.1679 0.6554 9.8711 8.8387 5.5229
temp: 298.150 k
press: 1.00000 atm
elementType: 8 8 8 7 6 6 6 6 6 6 6 6 6 6 6 6 6 6 6 6 6 6 6 6 6 1 1 1 1 1 1 1 1 1 1 1 1 1 1 1 1 1 1 1 1 1 1 1 1 1 1 1 1 1 1 1 1 1
symmnumber: 1
zpe: 1320202.2 jmol-1
zpe.correction: 0.502838 hartree
zpe.thermalcorrener: 0.529884 hartree
zpe.thermalcorrenthalpy: 0.530828 hartree
zpe.thermalcorrgfe: 0.441359 hartree
zpe.sumelectzpe: -1098.494969 hartree
zpe.sumelectthermal: -1098.467924 hartree
zpe.sumelectthermalent: -1098.466979 hartree
zpe.sumelectthermalfe: -1098.556448 hartree
dipole: -1.3240 -3.9467 2.2730
dipole: 4.7430
quadrupole: -125.6488 -158.9845 -151.0334
quadrupole: 5.9900 -0.5937 2.1422
quadrupole: 19.5734 -13.7623 -5.8111 5.9900 -0.5937 2.1422
hfenergy: -1098.9978071 hartree
pointgroup: C01 [X(C21H33N1O3)]
dipole: 0.5097635 -1.5167926 -0.9599558 debye
polarizability: 348.4196994|-28.6269541|213.3479611|10.6341068|17.580383|203.1799305 unknown
InChI: InChI=1S/C21H33NO3/c1-4-5-15-24-20-12-10-19(11-13-20)21(23)25-16-7-14-22-17(2)8-6-9-18(22)3/h10-13,17-18H,4-9,14-16H2,1-3H3
charge 0 multiplicity 1
58 atoms
O  -1.037163 1.42145 -0.839507
O  -0.713235 3.052539 0.796232
O  5.169152 0.371653 0.47595
N  -4.129918 -0.624791 -0.367212
C  -5.590693 -0.474326 -0.663783
C  -3.818371 -1.74577 0.576794
C  -6.365232 -0.221177 0.653282
C  -4.589616 -1.511408 1.903697
C  -6.106922 -1.33692 1.688039
C  -3.270281 -0.484511 -1.566745
C  -6.21177 -1.646653 -1.483895
C  -2.308962 -1.857555 0.883903
C  -3.118074 0.991297 -2.017118
C  -2.458796 1.870382 -0.956729
C  -0.256644 2.11173 0.095616
C  1.140384 1.607196 0.147374
C  1.599742 0.546718 -0.672833
C  2.045831 2.221405 1.057218
C  7.190022 -0.870791 0.005209
C  5.714121 -0.715375 -0.365131
C  3.827456 0.725009 0.315365
C  7.883463 -1.978734 -0.821719
C  2.934477 0.101306 -0.596181
C  3.375579 1.787258 1.143439
C  9.374355 -2.137261 -0.453788
H  -5.690388 0.439548 -1.281996
H  -4.155003 -2.72956 0.157716
H  -6.026797 0.745682 1.073824
H  -7.447036 -0.132014 0.433545
H  -4.393033 -2.363089 2.584131
H  -4.175171 -0.599701 2.3792
H  -6.6044 -1.091597 2.645919
H  -6.548891 -2.29219 1.339835
H  -3.636581 -1.085264 -2.434035
H  -2.26269 -0.857774 -1.328662
H  -6.212729 -2.596431 -0.920864
H  -7.259762 -1.409366 -1.745128
H  -5.663105 -1.81458 -2.42884
H  -1.891749 -0.866377 1.139578
H  -2.164164 -2.527787 1.750787
H  -1.723218 -2.277281 0.047175
H  -4.106878 1.429667 -2.255273
H  -2.521834 1.024376 -2.949849
H  -2.949499 1.742113 0.024154
H  -2.461151 2.941217 -1.229094
H  0.90246 0.076644 -1.372134
H  1.679262 3.03985 1.685152
H  7.703517 0.096492 -0.155165
H  7.267892 -1.100959 1.084996
H  5.597445 -0.446781 -1.435828
H  5.151695 -1.65199 -0.168866
H  7.79298 -1.746254 -1.902503
H  7.359642 -2.943565 -0.663406
H  3.266328 -0.71803 -1.239765
H  4.085216 2.24873 1.836403
H  9.493099 -2.400546 0.613846
H  9.854881 -2.931065 -1.053912
H  9.927957 -1.196288 -0.630818
