program: Gaussian 09
title: 000048970
version: EM64L-G09RevD.01
frameworkgroup: C1[X(C20H25NO3)]
method: RPBEPBE
basis: SDD
operation: Freq
keyword: #p
keyword: freq=noraman
keyword: PBEPBE/SDD
title: #p freq=noraman PBEPBE/SDD
converged: YES YES NO NO
title: Mulliken charges:
elementType: O O O N C C C C C C C C C C C C C C C C C C C C H H H H H H H H H H H H H H H H H H H H H H H H H
charge: -0.290938 -0.269171 -0.261983 -0.080308 -0.332683 -0.410576 -0.257077 -0.582142 -0.279407 -0.614457 -0.625662 0.467610 0.216830 0.381775 0.178038 -0.431391 -0.363525 -0.327496 -0.342730 -0.378167 -0.337556 -0.221221 -0.228808 -0.242335 0.208103 0.173738 0.219110 0.230227 0.224743 0.222546 0.234455 0.205696 0.224389 0.217703 0.225918 0.222476 0.186921 0.235242 0.185343 0.220601 0.227520 0.250497 0.270863 0.268293 0.251548 0.249648 0.224533 0.225244 0.228024
chargesum: 0.00000
title: Mulliken charges with hydrogens summed into heavy atoms:
elementType: O O O N C C C C C C C C C C C C C C C C C C C C
charge: -0.290938 -0.269171 -0.261983 -0.080308 0.049157 0.038761 0.190213 -0.141992 0.162685 0.020858 0.015525 0.467610 0.216830 0.381775 0.178038 -0.203872 -0.113028 -0.056633 -0.074436 -0.126619 -0.087908 0.003312 -0.003564 -0.014312
polarizability: 3.29727229e+02 2.19407510e+01 2.19118894e+02 -5.14475094e+00 2.36924095e+01 1.78997720e+02
1716.lowfreq: -9.4179 -3.7217 -0.0014 -0.0011 0.0012 0.5387 9.6148 10.6538 17.6968
frequency: 9.0982 9.8463 17.3928 26.5398 28.3889 37.7707 62.7869 66.7190 87.8440 96.9415 102.1376 129.9449 148.0807 162.6202 178.8514 181.9085 220.4678 229.6117 237.8869 254.7105 305.5155 316.1101 322.2162 344.5245 357.4089 393.9128 404.5838 416.7845 434.3248 446.5393 479.6258 497.4249 505.6092 514.2149 566.7012 617.6849 623.1090 637.6627 676.6236 704.6051 752.8949 754.4761 755.9244 769.6605 773.6557 802.6500 813.6991 823.2740 852.3292 854.5355 867.6307 883.9645 917.4146 923.1961 967.3299 970.9745 976.1087 989.6799 989.8610 993.9611 997.0867 1000.7321 1023.4148 1029.6288 1032.3426 1055.3874 1066.0345 1073.4535 1083.9237 1088.4631 1093.5313 1100.7512 1116.8413 1142.7625 1171.6951 1172.0634 1176.2702 1182.7919 1189.1709 1216.3601 1220.2209 1227.6870 1240.4366 1248.1655 1259.3094 1268.6566 1290.2018 1299.1151 1303.0342 1328.4458 1339.5824 1366.0080 1370.3097 1382.5155 1383.5519 1384.5475 1419.0218 1428.1479 1441.0276 1442.9488 1454.9464 1462.3242 1462.8437 1469.8248 1473.2161 1476.1854 1478.9867 1484.9619 1485.4249 1491.0471 1497.0718 1571.3766 1593.5906 1614.8067 1615.4113 1620.1439 2817.8881 2841.7834 2858.7901 2961.0348 2995.8364 2996.2079 3000.9862 3011.8797 3019.1954 3029.9641 3031.7412 3051.2821 3054.5632 3077.7260 3082.6784 3089.6264 3111.7246 3125.4882 3138.2738 3151.9411 3152.2097 3155.7084 3164.8982 3172.2987 3178.6501
redmass: 4.2903 4.0969 2.7573 4.8320 4.6624 4.5894 4.3782 4.5551 2.3843 4.0506 3.2035 3.4905 4.1899 3.5441 4.1278 3.5641 2.6914 1.7277 1.4716 1.6923 5.8296 2.8464 2.9988 2.6388 3.1831 2.8863 2.8097 2.9765 2.6511 4.4773 3.0652 4.1421 2.9440 4.9303 3.2313 6.4138 5.7788 5.6833 4.1267 1.7361 3.3173 4.4341 3.6570 1.1342 2.1083 5.2951 5.4649 1.3275 1.3966 1.4322 1.2276 3.3084 1.3786 7.2015 1.9667 1.6080 1.4399 1.3838 4.5088 1.4068 2.3402 3.1061 2.5199 2.0807 1.5368 3.9695 2.2039 2.6032 2.5615 1.6569 1.4057 1.6104 1.3243 1.5536 1.1237 1.1670 1.4543 1.1723 1.1285 2.1141 1.7515 2.6598 1.2605 3.2620 2.1858 1.2587 1.3731 1.2821 1.2757 1.2862 1.4898 1.4896 1.4304 4.5359 4.6047 1.5203 1.1436 4.2125 2.1408 1.1696 1.1131 1.0524 1.0645 1.1705 1.0750 1.0695 1.0575 1.1595 1.9575 1.0887 2.3013 8.1658 6.0672 6.4236 9.4355 6.6998 1.0701 1.0576 1.0576 1.0558 1.0622 1.0578 1.0826 1.0618 1.0719 1.1056 1.0715 1.1050 1.1016 1.1015 1.1053 1.1006 1.0874 1.0864 1.0922 1.0945 1.0893 1.0880 1.1009 1.0968 1.0965
irintensity: 0.1538 0.0780 0.8122 0.0890 0.5788 0.6408 0.1231 0.1865 0.3488 0.1410 0.7403 0.1977 0.9709 1.8752 3.7726 9.4718 1.9006 0.0397 6.4000 1.6467 0.0351 3.0677 6.2919 6.4905 7.5616 1.4322 0.2509 0.0892 1.2654 4.1540 11.1600 10.8780 8.5654 1.8586 6.9428 0.3303 14.2270 21.9799 25.0340 64.7176 35.2774 18.0154 1.7044 1.9354 20.0684 17.6380 8.7057 8.3519 25.2769 29.8630 0.7446 37.6517 3.4350 20.1697 29.4381 16.9969 3.6299 1.6551 15.5346 13.9173 36.3548 30.9441 21.4508 11.6891 26.5511 357.1599 22.2722 58.8872 35.0498 9.1341 8.9866 0.8171 8.1345 6.5575 97.1709 179.1080 8.1349 7.3964 2.1861 18.1123 7.6444 140.2646 14.5114 536.0111 13.8470 4.3127 28.1582 0.2138 13.8417 2.1300 2.8025 16.3468 3.9347 3.3836 2.8449 9.8106 2.0692 28.5998 6.1482 3.9567 17.0451 12.0578 13.4303 42.5508 5.5614 5.7462 12.0062 16.8524 26.5170 26.6340 59.9303 65.6963 0.8602 27.5329 115.6392 309.3733 74.2128 73.0043 229.4345 31.4028 24.4788 13.3988 15.4501 35.9178 46.2685 49.0902 44.2872 2.5827 19.4101 23.3659 65.4895 48.1781 10.3315 0.6041 25.1848 36.5744 3.2026 10.1072 14.0032 8.2759 4.9631
temp: 298.150 k
press: 1.00000 atm
elementType: 8 8 8 7 6 6 6 6 6 6 6 6 6 6 6 6 6 6 6 6 6 6 6 6 1 1 1 1 1 1 1 1 1 1 1 1 1 1 1 1 1 1 1 1 1 1 1 1 1
symmnumber: 1
zpe: 1067476.4 jmol-1
zpe.correction: 0.406580 hartree
zpe.thermalcorrener: 0.430979 hartree
zpe.thermalcorrenthalpy: 0.431923 hartree
zpe.thermalcorrgfe: 0.345987 hartree
zpe.sumelectzpe: -1055.741545 hartree
zpe.sumelectthermal: -1055.717147 hartree
zpe.sumelectthermalent: -1055.716202 hartree
zpe.sumelectthermalfe: -1055.802139 hartree
dipole: -0.5351 -3.3325 -0.7951
dipole: 3.4676
quadrupole: -123.8373 -142.4120 -140.2471
quadrupole: -0.9708 6.1181 1.0435
quadrupole: 11.6615 -6.9132 -4.7483 -0.9708 6.1181 1.0435
hfenergy: -1056.1481253 hartree
pointgroup: C01 [X(C20H25N1O3)]
dipole: 0.183686 1.3514806 0.0311464 debye
polarizability: 328.569032|22.0514091|228.9588272|13.0013015|-10.3398459|170.3159836 unknown
InChI: InChI=1S/C20H25NO3/c1-21(2)14-6-15-24-20(22)18-9-11-19(12-10-18)23-16-13-17-7-4-3-5-8-17/h3-5,7-12H,6,13-16H2,1-2H3
charge 0 multiplicity 1
49 atoms
O  -3.366528 -0.620631 -0.271793
O  2.99431 -0.244989 -1.109111
O  -2.821706 -2.874456 -0.017211
N  -7.920553 1.2728 0.138962
C  -7.070881 0.069285 0.300504
C  -5.585042 0.329471 -0.03041
C  -4.792838 -0.978893 -0.037041
C  4.944613 1.157961 -1.484553
C  3.411883 1.151172 -1.35541
C  -9.358196 0.932037 0.18247
C  -7.589858 2.353986 1.089827
C  5.683167 0.943231 -0.169392
C  -1.060852 -1.247772 -0.472577
C  1.636319 -0.503376 -0.908142
C  -2.458199 -1.68929 -0.233935
C  6.325821 2.028711 0.479443
C  5.734104 -0.338026 0.439791
C  -0.02943 -2.227742 -0.446051
C  -0.722186 0.105618 -0.722431
C  1.306405 -1.862633 -0.660884
C  0.617015 0.484993 -0.940785
C  7.000309 1.844074 1.708638
C  6.406926 -0.525782 1.667506
C  7.04278 0.564312 2.3071
H  -7.46111 -0.703781 -0.39099
H  -7.149645 -0.355918 1.338013
H  -5.128731 1.010287 0.711228
H  -5.519532 0.818565 -1.019093
H  -5.119544 -1.664895 -0.840951
H  -4.867031 -1.520438 0.924951
H  5.221311 0.381515 -2.222706
H  5.233097 2.134527 -1.918177
H  3.080758 1.792632 -0.514555
H  2.940812 1.505787 -2.295054
H  -9.588653 0.186555 -0.599551
H  -9.960167 1.835844 -0.020434
H  -9.687758 0.512755 1.168028
H  -6.551622 2.695013 0.941895
H  -7.707225 2.048004 2.161925
H  -8.254312 3.216925 0.906271
H  6.303686 3.024216 0.017467
H  5.234595 -1.181207 -0.048886
H  -0.303174 -3.269956 -0.252619
H  -1.517163 0.85617 -0.744445
H  2.111623 -2.602898 -0.642054
H  0.853457 1.535224 -1.132533
H  7.493796 2.693911 2.193976
H  6.436428 -1.521289 2.124996
H  7.566724 0.417295 3.258281
