program: Gaussian 09
title: 000048938
version: EM64L-G09RevD.01
frameworkgroup: C1[X(C16H25NO2S)]
method: RPBEPBE
basis: SDD
operation: Freq
keyword: #p
keyword: freq=noraman
keyword: PBEPBE/SDD
title: #p freq=noraman PBEPBE/SDD
converged: YES YES NO NO
title: Mulliken charges:
elementType: S O O N C C C C C C C C C C C C C C C C H H H H H H H H H H H H H H H H H H H H H H H H H
charge: 0.191450 -0.278880 -0.246060 -0.093080 -0.367286 -0.319718 -0.384402 -0.296944 -0.693028 -0.681442 0.283002 0.170419 -0.339895 -0.616168 -0.327898 -0.323341 -0.232905 -0.232762 -0.215541 -0.679931 0.223356 0.217477 0.224622 0.187515 0.220588 0.214692 0.236500 0.233522 0.212236 0.228167 0.213445 0.221336 0.220734 0.216733 0.249802 0.276543 0.200565 0.247108 0.267334 0.263293 0.234770 0.234985 0.206015 0.213964 0.219106
chargesum: 0.00000
title: Mulliken charges with hydrogens summed into heavy atoms:
elementType: S O O N C C C C C C C C C C C C C C C C
charge: 0.191450 -0.278880 -0.246060 -0.093080 0.073548 0.092419 0.050878 0.173078 -0.039180 -0.022639 0.283002 0.170419 -0.339895 -0.089823 0.119775 -0.056007 0.030388 0.002008 0.019444 -0.040846
polarizability: 2.51916097e+02 1.46733203e+01 2.45437947e+02 -5.03795961e+00 -9.85210908e+00 1.41653242e+02
1716.lowfreq: -13.0322 -6.7338 -4.9882 -0.0017 0.0008 0.0014 11.3278 17.8046 22.3290
frequency: 7.4260 17.0040 21.9417 32.5816 44.9761 49.8923 56.0036 80.5847 86.6493 93.5512 109.0823 145.1258 166.1326 176.2122 190.8891 214.4031 219.6507 230.7332 232.5154 266.3944 276.5247 287.1786 297.4106 326.9615 352.9265 369.3500 401.9864 423.3218 439.6308 477.2397 488.5959 516.5446 541.2239 638.8566 672.7255 679.3659 693.2778 736.9850 743.6339 753.2413 758.5999 770.0636 785.3279 798.9274 813.1935 850.0965 890.4788 895.0365 899.3539 910.6610 971.3704 973.7468 999.5506 1010.3541 1030.9681 1038.0883 1039.1659 1050.1382 1058.6735 1066.6343 1068.3267 1079.0019 1088.4155 1106.7033 1116.2486 1127.3945 1174.2351 1181.8811 1205.6314 1214.1042 1227.3543 1240.2899 1249.7833 1263.6135 1279.7572 1289.4163 1299.6196 1321.2962 1334.3328 1335.7141 1342.2492 1363.0237 1370.9018 1373.2827 1380.5101 1388.1589 1388.2697 1414.2545 1432.1350 1447.9073 1452.5422 1457.8093 1467.8009 1472.4211 1473.1478 1477.6387 1478.7904 1480.3538 1484.2302 1488.4674 1497.5391 1563.6150 1592.0924 1617.6802 2871.0256 2917.0501 2974.1147 2977.3993 2982.7504 2990.0609 2990.8947 3021.3723 3024.1246 3035.8425 3040.9511 3044.3356 3052.5059 3072.8716 3075.3546 3075.6446 3078.5198 3080.2934 3089.4802 3124.3637 3128.4821 3133.9637 3150.9449 3165.6924 3178.3834
redmass: 3.7523 3.2684 4.8581 3.9713 3.6135 2.8025 4.1971 3.4348 1.9289 2.9866 3.4745 2.2105 1.8374 5.9110 3.0512 1.5697 1.8202 1.1357 4.0018 1.6204 2.3121 3.5462 3.8437 3.8773 4.4614 7.9425 2.3498 3.9220 5.8641 3.9173 2.8008 3.6310 4.1214 6.3019 5.0530 4.9319 5.2589 1.1321 2.9591 2.3056 2.3464 1.1431 1.8023 1.2726 1.5220 1.2108 1.7010 1.8651 1.8548 4.6858 1.3968 2.4604 1.3457 6.6311 3.7408 2.7946 2.0714 1.4458 2.5261 2.4616 2.0091 2.2608 2.1997 2.1800 1.6494 1.6679 1.0651 1.7114 2.0782 1.4303 3.1399 1.2164 1.4497 1.4428 1.1215 1.1030 1.1900 1.3215 1.4211 1.3333 1.2282 8.7123 1.3754 1.2702 1.2647 1.2691 1.2085 2.0230 1.1019 1.2067 2.0069 1.0686 1.0493 1.0552 1.0585 1.0454 1.0611 1.0466 1.0699 1.0746 1.0805 6.2580 6.3324 9.8436 1.0714 1.0684 1.0353 1.0351 1.0370 1.0644 1.0605 1.0880 1.0620 1.0921 1.0895 1.0699 1.0964 1.0990 1.0988 1.0989 1.0997 1.1008 1.1004 1.1047 1.1080 1.0861 1.0912 1.0960 1.0977
irintensity: 0.0583 0.0780 0.4990 0.5067 0.1793 0.3956 1.2027 0.0689 0.2792 0.3189 0.1515 0.6695 1.4117 0.1106 0.7471 0.6314 1.1218 0.1665 4.0803 1.0717 0.7940 1.8054 13.6461 2.5534 10.5066 0.5647 3.5052 4.4081 1.0732 9.8755 9.9152 8.6376 6.1427 5.1501 15.2642 13.1949 5.5009 23.9396 4.5863 41.3862 5.1200 5.9914 36.6540 6.2248 1.5415 1.4480 4.4595 7.5956 13.6715 23.2378 2.4156 9.6966 0.6606 209.2254 21.7708 45.0395 3.7002 6.3331 13.2715 121.2022 0.0974 19.5363 58.7699 13.7457 5.2085 15.7137 1.4587 10.8872 34.4131 12.5255 238.3987 9.2609 23.9535 14.1031 3.9305 2.2020 10.8770 7.6703 6.3974 4.0971 12.4121 5.0455 19.2335 21.6917 9.2730 22.5682 11.8277 9.9827 3.6355 21.9552 18.4554 15.9988 14.2180 6.4304 2.4324 14.1127 2.9284 5.1999 12.4499 17.7389 2.7656 8.4333 11.1162 171.2846 75.2263 57.7906 40.3829 27.8816 25.4710 23.8382 49.3693 12.7511 28.1081 20.3460 9.6261 32.6865 2.3273 39.7504 30.8841 98.4164 46.0597 45.8510 40.2519 19.4580 13.6896 2.5098 12.6802 15.1989 13.9475
temp: 298.150 k
press: 1.00000 atm
elementType: 16 8 8 7 6 6 6 6 6 6 6 6 6 6 6 6 6 6 6 6 1 1 1 1 1 1 1 1 1 1 1 1 1 1 1 1 1 1 1 1 1 1 1 1 1
symmnumber: 1
zpe: 996211.3 jmol-1
zpe.correction: 0.379437 hartree
zpe.thermalcorrener: 0.402829 hartree
zpe.thermalcorrenthalpy: 0.403773 hartree
zpe.thermalcorrgfe: 0.321556 hartree
zpe.sumelectzpe: -1226.383833 hartree
zpe.sumelectthermal: -1226.360441 hartree
zpe.sumelectthermalent: -1226.359497 hartree
zpe.sumelectthermalfe: -1226.441714 hartree
dipole: 1.5348 -1.5320 2.3035
dipole: 3.1637
quadrupole: -117.3844 -119.0670 -133.1056
quadrupole: 3.9323 -3.6685 -1.4663
quadrupole: 5.8013 4.1187 -9.9200 3.9323 -3.6685 -1.4663
hfenergy: -1226.76327 hartree
pointgroup: C01 [X(C16H25N1O2S1)]
dipole: 0.4345027 0.0062944 -1.1663683 debye
polarizability: 258.4519565|-5.3155851|193.4218757|11.9803355|-49.349349|187.1334543 unknown
InChI: InChI=1S/C16H25NO2S/c1-4-13-20-15-10-8-7-9-14(15)16(18)19-12-11-17(5-2)6-3/h7-10H,4-6,11-13H2,1-3H3
charge 0 multiplicity 1
45 atoms
S  -2.956232 -1.231991 1.84189
O  0.053827 1.566178 -0.232548
O  -0.100071 -0.544309 0.742336
N  3.774631 0.952764 -0.56883
C  2.359192 0.991913 -0.997523
C  4.121391 -0.281013 0.182937
C  4.750431 1.377491 -1.60162
C  1.501104 1.601251 0.130964
C  5.397784 -0.137107 1.032022
C  4.926767 0.421981 -2.814057
C  -2.061804 0.462809 -0.352275
C  -0.643691 0.399339 0.117308
C  -3.123668 -0.254375 0.286064
C  -2.022132 -2.801745 1.269385
C  -1.085448 -3.277415 2.389328
C  -2.358414 1.276889 -1.481691
C  -4.441866 -0.117534 -0.216963
C  -3.670388 1.388127 -1.980147
C  -4.720128 0.69126 -1.340089
C  -0.363625 -4.588431 2.000527
H  1.9579 -0.01498 -1.255369
H  2.263221 1.621917 -1.900794
H  3.271179 -0.506069 0.853534
H  4.221165 -1.165919 -0.494077
H  5.72943 1.528205 -1.110224
H  4.433654 2.373559 -1.966052
H  1.728616 2.668611 0.269368
H  1.646963 1.052024 1.076543
H  6.300568 -0.004158 0.408635
H  5.312184 0.734176 1.70513
H  5.549583 -1.043795 1.646052
H  5.313836 -0.56548 -2.503503
H  3.968357 0.262654 -3.342309
H  5.644769 0.851824 -3.537354
H  -2.78627 -3.556051 1.013206
H  -1.446847 -2.519488 0.375592
H  -1.659096 -3.434303 3.324441
H  -0.348856 -2.477917 2.584381
H  -1.5381 1.826344 -1.951096
H  -5.247557 -0.660198 0.286788
H  -3.872674 2.015922 -2.854346
H  -5.747695 0.771267 -1.711441
H  -1.084464 -5.405927 1.809635
H  0.243501 -4.449558 1.086575
H  0.313772 -4.917038 2.809768
