program: Gaussian 09
title: 000048897
version: EM64L-G09RevD.01
frameworkgroup: C1[X(C22H23NO)]
method: RPBEPBE
basis: SDD
operation: Freq
keyword: #p
keyword: freq=noraman
keyword: PBEPBE/SDD
title: #p freq=noraman PBEPBE/SDD
converged: YES YES NO NO
title: Mulliken charges:
elementType: O N C C C C C C C C C C C C C C C C C C C C C C H H H H H H H H H H H H H H H H H H H H H H H
charge: -0.451436 -0.138179 -0.398002 -0.213172 -0.491788 -0.481161 0.435206 0.452515 0.427277 -0.454613 -0.376747 -0.355407 -0.370374 -0.461125 -0.435892 -0.218138 -0.228451 -0.228808 -0.248715 -0.219777 -0.226762 -0.239791 -0.246562 -0.248871 0.211196 0.254949 0.197640 0.207927 0.200703 0.246555 0.196381 0.233569 0.269374 0.272215 0.301841 0.230348 0.227289 0.342988 0.227028 0.228092 0.224453 0.222689 0.222875 0.221254 0.230157 0.225661 0.223587
chargesum: 0.00000
title: Mulliken charges with hydrogens summed into heavy atoms:
elementType: O N C C C C C C C C C C C C C C C C C C C C C C
charge: -0.108448 -0.138179 0.068143 -0.015532 -0.083157 -0.038224 0.435206 0.452515 0.427277 -0.221043 -0.107372 -0.083191 -0.068533 -0.230778 -0.208603 0.008890 -0.000359 -0.004355 -0.026026 0.003097 -0.005508 -0.009633 -0.020900 -0.025284
polarizability: 2.73247025e+02 1.68115712e+01 2.44980820e+02 -2.99238500e+00 2.18126537e+01 1.97933920e+02
1716.lowfreq: -1.7624 -0.0008 -0.0008 -0.0008 2.6665 5.4502 15.4954 22.9748 28.2382
frequency: 15.3642 22.8816 28.2302 32.9459 38.6839 44.4957 72.1619 81.6763 110.0758 134.8201 171.2003 193.6060 199.8939 213.0498 256.3365 301.1207 309.0768 314.3124 320.1430 358.0438 398.5742 404.9830 406.7666 408.5801 429.7601 469.4610 481.6756 527.1966 534.4004 592.0425 613.7790 615.5708 615.9232 618.3328 629.5249 704.2506 706.8695 707.5748 738.4493 747.1575 765.9198 795.8423 807.8219 810.3730 854.0200 857.4802 859.6137 861.7719 880.3356 914.0792 915.2852 924.0898 977.6931 979.3679 980.1057 982.2300 983.6784 988.6996 989.4317 990.3681 997.4280 1002.6812 1006.2160 1018.3479 1024.3315 1026.5241 1028.4172 1029.9437 1076.2419 1080.7231 1084.2858 1126.3612 1142.1704 1169.4481 1169.9334 1172.6738 1180.2008 1184.5785 1186.2937 1200.3908 1207.2661 1211.2608 1224.7825 1251.4939 1259.8559 1265.8502 1294.1399 1317.9531 1322.6952 1331.4552 1334.0532 1361.5463 1362.5154 1381.2888 1386.4643 1386.6401 1392.7098 1439.1172 1440.5934 1441.1762 1457.3880 1464.5498 1468.9334 1480.5114 1483.2388 1483.6617 1592.5527 1593.5822 1594.2799 1611.9160 1613.8782 1614.7743 2836.4217 2848.6062 2866.6643 2941.0794 2991.1473 3001.5216 3056.7509 3106.8209 3109.0299 3113.9689 3120.7319 3122.2693 3125.7609 3134.5343 3135.1739 3137.2657 3147.3857 3148.3928 3152.0595 3160.6056 3161.8914 3163.8280 3550.9379
redmass: 5.0103 5.0381 5.1625 3.7715 3.8990 3.8920 5.2107 4.6576 4.0326 3.8042 4.6880 4.5004 4.6053 4.3889 2.7886 2.0895 2.7988 2.6098 1.6928 2.5395 3.8837 2.8074 2.8634 2.9888 2.9000 2.9866 3.0579 3.8189 3.1415 5.2051 5.5686 6.3757 6.2299 5.8319 5.1596 2.2644 1.7618 2.1586 1.4883 1.4933 1.8777 3.7119 3.7376 4.0723 2.4741 1.3485 1.3506 1.2529 3.0097 1.3775 1.3713 1.4541 1.8679 1.4921 1.6039 1.5477 1.4522 4.3905 6.1092 4.6781 1.3354 1.4112 1.6443 2.3869 2.2394 2.1732 2.1042 2.5158 1.6173 1.5925 1.6022 1.9385 2.1855 1.0547 1.0550 1.0569 1.1178 1.1163 1.1169 2.1355 2.3880 2.4166 1.3215 1.3919 1.3425 1.3555 1.4493 1.3397 1.3783 1.3582 1.2703 1.6725 1.7945 1.6837 6.5424 4.5141 2.6246 2.0985 2.0339 2.0989 1.1378 1.1318 1.1889 2.2868 1.9855 2.1727 6.0966 6.0744 6.1567 6.0893 6.0748 5.9545 1.0718 1.0718 1.0708 1.0836 1.0848 1.0849 1.0878 1.0870 1.0873 1.0874 1.0865 1.0862 1.0861 1.0926 1.0917 1.0912 1.0953 1.0960 1.0959 1.1012 1.0994 1.1014 1.0658
irintensity: 0.2790 0.0186 0.0719 0.2512 0.1013 0.0617 0.9618 0.0629 1.4826 1.0654 1.0981 1.0835 0.5631 0.6670 6.4372 31.2377 15.7690 2.5588 83.7979 36.5940 0.4219 0.5394 0.7994 0.1826 4.1324 13.2825 10.7566 4.2135 30.1709 0.9337 1.3693 1.2673 0.4569 3.8550 8.8028 24.4926 41.3388 53.0618 59.9754 88.6795 29.3197 11.3370 2.6658 13.3825 21.9065 4.0067 2.0314 0.8978 3.7561 7.2867 3.1593 7.6601 14.8871 4.5117 11.6283 8.0069 4.5549 0.4315 0.3837 0.8477 1.6630 7.9954 11.2426 20.5599 64.1952 3.6941 14.7264 22.4371 1.2529 11.9843 3.7512 40.3844 37.3633 0.4039 0.2691 0.1150 4.2935 1.4966 1.5084 3.1974 10.4405 3.8799 15.5709 20.7138 27.3038 14.1716 5.1488 8.1576 8.9120 3.5054 3.6273 9.2946 2.6713 3.0093 1.6916 5.7118 4.5474 5.9629 9.6379 25.0750 2.4075 7.4661 14.7087 10.7064 13.8360 17.2589 0.9474 0.8104 0.9238 4.8189 8.6601 6.4337 54.2407 77.4596 148.0480 55.2917 9.4018 29.9858 14.0767 9.0816 9.3629 9.3412 2.0436 0.5798 0.0400 26.3587 34.9746 14.7858 26.4960 30.4299 17.1188 33.0297 27.2218 24.0864 8.3757
temp: 298.150 k
press: 1.00000 atm
elementType: 8 7 6 6 6 6 6 6 6 6 6 6 6 6 6 6 6 6 6 6 6 6 6 6 1 1 1 1 1 1 1 1 1 1 1 1 1 1 1 1 1 1 1 1 1 1 1
symmnumber: 1
zpe: 1021607.0 jmol-1
zpe.correction: 0.389110 hartree
zpe.thermalcorrener: 0.410595 hartree
zpe.thermalcorrenthalpy: 0.411539 hartree
zpe.thermalcorrgfe: 0.334878 hartree
zpe.sumelectzpe: -980.374372 hartree
zpe.sumelectthermal: -980.352886 hartree
zpe.sumelectthermalent: -980.351942 hartree
zpe.sumelectthermalfe: -980.428603 hartree
dipole: 1.9778 -1.6543 -0.6546
dipole: 2.6603
quadrupole: -131.8943 -135.9924 -133.6541
quadrupole: 0.1932 3.1472 2.6448
quadrupole: 1.9526 -2.1454 0.1928 0.1932 3.1472 2.6448
hfenergy: -980.7634811 hartree
pointgroup: C01 [X(C22H23N1O1)]
dipole: -0.7177658 -0.712994 0.2681474 debye
polarizability: 276.303956|-11.5587795|237.9098115|5.3005984|-25.8918347|201.9479979 unknown
InChI: InChI=1S/C22H23NO/c24-22(21-14-8-3-9-15-21)18-23(16-19-10-4-1-5-11-19)17-20-12-6-2-7-13-20/h1-15,22,24H,16-18H2
charge 0 multiplicity 1
47 atoms
O  -1.036751 -0.606524 -1.687611
N  0.576822 -0.133751 0.716152
C  -0.886377 -0.307849 0.717505
C  -1.39764 -1.244225 -0.404124
C  1.336886 -1.296351 1.220006
C  1.049494 1.145197 1.287238
C  -2.903636 -1.463814 -0.292116
C  2.748567 -1.38334 0.641919
C  0.646463 2.386068 0.493554
C  -3.422053 -2.680006 0.215946
C  -3.803894 -0.437118 -0.679154
C  2.978048 -1.072621 -0.72255
C  0.392659 2.323664 -0.899712
C  3.833871 -1.820408 1.439817
C  0.57801 3.641979 1.14825
C  -4.8173 -2.869024 0.344147
C  -5.197438 -0.625476 -0.554491
C  4.270117 -1.20069 -1.277204
C  0.089384 3.499973 -1.62189
C  5.128449 -1.952582 0.885308
C  0.281729 4.819336 0.425132
C  -5.708684 -1.841341 -0.040795
C  5.350178 -1.643511 -0.476218
C  0.037944 4.752411 -0.966611
H  -1.272673 -0.705675 1.689605
H  -1.354343 0.680162 0.563841
H  -0.887776 -2.229842 -0.327633
H  0.782826 -2.211412 0.933729
H  1.394847 -1.309949 2.338505
H  2.156425 1.089523 1.307668
H  0.725271 1.273254 2.352664
H  -2.733373 -3.48318 0.508451
H  -3.40272 0.499491 -1.082974
H  2.132698 -0.718287 -1.323263
H  0.405364 1.347246 -1.395072
H  3.667603 -2.054268 2.499521
H  0.760452 3.699544 2.229539
H  -1.473959 -1.115187 -2.417714
H  -5.207572 -3.814722 0.736849
H  -5.885287 0.172464 -0.856523
H  4.437646 -0.953932 -2.332094
H  -0.10892 3.43788 -2.698434
H  5.961095 -2.288497 1.51416
H  0.236186 5.78326 0.945298
H  -6.790544 -1.987398 0.054244
H  6.353442 -1.74053 -0.906757
H  -0.195334 5.663257 -1.530109
