program: Gaussian 09
title: 000048866
version: EM64L-G09RevD.01
frameworkgroup: C1[X(C13H20N6)]
method: RPBEPBE
basis: SDD
operation: Freq
keyword: #pfreq=noraman
keyword: PBEPBE/SDD
title: #p freq=noraman PBEPBE/SDD
converged: YES YES NO NO
title: Mulliken charges:
elementType: N N N N N N C C C C C C C C C C C C C H H H H H H H H H H H H H H H H H H H H
charge: -0.111075 -0.075256 -0.486585 -0.430853 0.000498 -0.045606 -0.390914 -0.329573 -0.324593 -0.478678 -0.670290 -0.672160 0.288568 0.440935 -0.352432 -0.424889 -0.150025 -0.362691 -0.124160 0.218487 0.223229 0.203397 0.194943 0.203934 0.193012 0.218713 0.222725 0.210260 0.221722 0.208809 0.211131 0.224222 0.209001 0.330235 0.377902 0.234390 0.320562 0.231280 0.241826
chargesum: 0.00000
title: Mulliken charges with hydrogens summed into heavy atoms:
elementType: N N N N N N C C C C C C C C C C C C C
charge: -0.111075 -0.075256 -0.156350 -0.052951 0.000498 -0.045606 0.050803 0.068767 0.072354 -0.037240 -0.029500 -0.027806 0.288568 0.440935 -0.118042 -0.104327 0.081255 -0.120866 -0.124160
polarizability: 2.50618712e+02 -1.15022810e+00 2.12861859e+02 1.84734886e+00 4.35689118e+00 1.15823759e+02
1716.lowfreq: -7.9525 -3.9217 0.0002 0.0007 0.0007 6.1016 14.6111 22.4762 35.4736
frequency: 14.2043 22.4160 35.4642 37.3085 55.5887 69.8890 76.2151 83.0437 96.0023 115.6846 151.7146 180.0185 197.2466 208.3291 225.5602 254.1839 261.3247 291.0506 303.0104 330.8715 363.1843 407.2992 411.3401 432.4731 452.1873 484.5143 486.8621 503.9963 549.9414 571.9715 591.7287 612.2924 661.8500 694.5006 716.8439 741.9896 787.1475 793.2814 796.1432 807.7499 820.1756 901.1189 905.8016 914.2406 949.8916 970.4729 989.7261 994.6018 1024.5431 1031.4923 1050.1825 1057.1958 1074.8956 1084.1947 1086.7923 1114.4378 1120.6982 1134.9901 1159.3059 1193.1603 1206.7055 1217.2952 1243.2505 1272.9647 1281.6385 1289.7755 1297.1232 1317.6883 1323.1186 1329.8399 1361.6857 1363.5965 1376.4995 1386.5776 1387.8719 1412.8459 1415.2411 1448.6199 1460.0250 1460.4426 1462.8597 1470.0452 1478.5920 1480.7854 1485.9661 1490.6016 1521.1854 1581.9552 1589.0658 1684.0135 2183.5353 2859.1675 2867.9991 2900.0378 2913.1595 2954.9999 2981.9454 2983.8727 3017.8640 3034.5178 3057.5378 3075.1065 3077.2483 3089.6104 3090.2356 3116.0323 3136.1454 3164.7581 3188.8607 3493.4401 3542.7016
redmass: 3.5677 4.8112 4.3829 5.2271 3.6308 3.0013 2.0828 2.7587 4.8869 4.5251 2.1438 1.9148 2.7039 3.4330 1.5891 2.2275 2.8537 2.4445 2.5645 6.0799 3.3801 3.2727 3.4791 1.3023 2.6598 5.4807 2.9961 3.0189 7.3608 1.3850 6.2134 8.1051 7.8108 6.3527 2.0559 2.8342 1.1872 1.1996 1.2817 1.7255 3.9944 5.8522 1.3456 1.9785 1.3718 1.3827 2.2696 3.9613 6.3656 2.8415 1.7244 2.8110 1.9321 2.1683 2.9710 1.7556 1.6543 3.2697 1.5290 1.3105 2.2806 3.8779 1.5634 2.2465 1.2012 1.2579 1.1284 2.7226 1.4825 1.5021 1.3428 1.3730 1.4382 1.2359 1.2353 1.3157 2.1984 1.0919 2.4242 1.0614 1.0550 1.0586 1.0580 1.0668 1.0665 1.0738 2.7284 2.4673 5.6193 6.4581 12.2334 1.0717 1.0715 1.0558 1.0699 1.1022 1.0356 1.0357 1.0875 1.0876 1.0924 1.0983 1.0982 1.1003 1.1004 1.0901 1.0896 1.0993 1.0939 1.0762 1.0760
irintensity: 0.0688 0.4803 0.2558 6.4107 0.3785 0.3632 0.2856 1.0336 5.0897 11.9369 5.3291 0.3788 1.0785 0.5825 1.0739 2.5700 0.3667 1.6301 0.3397 3.4924 3.4839 5.3112 6.3369 90.4925 9.4846 8.4465 4.9866 16.0877 18.1066 21.4398 7.3207 1.8642 40.1666 1.6026 38.2419 8.6926 4.2654 3.4951 10.6411 63.3114 0.6013 8.7267 0.0058 4.1728 10.2433 0.4043 7.5193 2.9358 46.1330 2.2530 23.8430 34.5126 15.7603 2.9014 22.8189 11.1575 16.7552 46.3373 10.2087 1.2965 37.6706 133.7728 21.0066 41.8924 15.3247 33.5373 12.3520 68.8722 17.8902 4.0161 2.1779 3.3950 28.5043 24.4000 24.0469 42.7415 116.9534 25.1110 120.1295 4.1413 5.0122 3.5638 2.5720 14.4451 9.8889 10.8831 219.5378 107.7740 144.2867 631.6892 209.6226 37.1938 154.1383 32.8496 101.8092 39.8940 31.6121 32.8358 24.8530 19.1257 27.2490 50.5004 70.0583 44.9840 43.5040 10.2321 13.2276 28.2138 4.4344 32.6182 81.9320
temp: 298.150 k
press: 1.00000 atm
elementType: 7 7 7 7 7 7 6 6 6 6 6 6 6 6 6 6 6 6 6 1 1 1 1 1 1 1 1 1 1 1 1 1 1 1 1 1 1 1 1
symmnumber: 1
zpe: 845048.0 jmol-1
zpe.correction: 0.321862 hartree
zpe.thermalcorrener: 0.342467 hartree
zpe.thermalcorrenthalpy: 0.343411 hartree
zpe.thermalcorrgfe: 0.268907 hartree
zpe.sumelectzpe: -834.392350 hartree
zpe.sumelectthermal: -834.371745 hartree
zpe.sumelectthermalent: -834.370801 hartree
zpe.sumelectthermalfe: -834.445305 hartree
dipole: -2.0724 0.7664 -0.1868
dipole: 2.2175
quadrupole: -98.3358 -135.1805 -116.7044
quadrupole: -4.4682 1.1442 -2.3640
quadrupole: 18.4044 -18.4403 0.0359 -4.4682 1.1442 -2.3640
hfenergy: -834.7142119 hartree
pointgroup: C01 [X(C13H20N6)]
dipole: 0.8243791 -0.2827512 0.0396345 debye
polarizability: 250.6075291|0.7859517|202.1350193|2.9039609|-30.6904185|126.5617809 unknown
InChI: InChI=1S/C13H20N6/c1-3-19(4-2)9-8-16-13(17-11-14)18-12-6-5-7-15-10-12/h5-7,10,17-18H,3-4,8-9H2,1-2H3
charge 0 multiplicity 1
39 atoms
N  3.896127 0.600151 -0.12984
N  0.193337 -0.148895 0.01417
N  -2.071216 -0.874101 0.231702
N  -0.336172 -2.349434 0.872013
N  -2.921652 2.506854 -1.178859
N  -2.033692 -4.137445 1.519819
C  2.436127 0.850931 -0.184894
C  4.433743 0.077312 -1.416057
C  4.674143 1.74767 0.41015
C  1.636687 -0.422741 0.163923
C  5.710779 -0.766332 -1.240601
C  4.533772 1.895989 1.936975
C  -0.692035 -1.041035 0.341132
C  -2.790222 0.247672 -0.247792
C  -4.209881 0.162966 -0.253396
C  -2.18836 1.449989 -0.723911
C  -4.963264 1.254833 -0.722903
C  -4.282075 2.408706 -1.177329
C  -1.213286 -3.310669 1.222488
H  2.100943 1.218489 -1.182709
H  2.16402 1.634027 0.544206
H  3.651803 -0.558779 -1.873064
H  4.624345 0.906508 -2.143646
H  5.739122 1.575049 0.170794
H  4.388515 2.706396 -0.091493
H  1.962871 -1.247162 -0.510893
H  1.913628 -0.715373 1.202558
H  6.539918 -0.176406 -0.809916
H  5.515429 -1.617812 -0.56533
H  6.052486 -1.157583 -2.217157
H  3.485162 2.074226 2.237939
H  4.881908 0.977687 2.441315
H  5.134481 2.75086 2.299998
H  -2.647929 -1.663845 0.537468
H  0.664267 -2.523026 0.986924
H  -4.71219 -0.744835 0.104881
H  -1.101799 1.546159 -0.731336
H  -6.056941 1.214008 -0.737282
H  -4.830097 3.280591 -1.550949
